{"text_format":"1","workbook":"xlsx","n_sheets":24,"sheets":["ETAPE 1","Questions suppl Rapp FIN","Reponses sur questions FIN","INSTRUCTION DEMANDE DE BUDGET","DEMANDE DE BUDGET","BUDGET INI APPROUVE","INSTRUCTION MODIFICATION BUDGET","DEMANDE BUDGET AJU","BUDGET AJU APPROUVE","INSTRUCTION DEPENSES REELLES","QUESTIONS RAPPORT FINAL","ARGUMENTATION","Frais de personnel","Location","Investissements","Frais de fonctionnement directs","Frais de fctment indirects","Aperçu budget-dépenses","BUDGET VS ACTUAL","FEEDBACK Rapport intermédiaire","FEEDBACK Rapport final","RAPPORT FINAL DU CONTROLE","Recap Budget-Depenses","Liste Dropdown"],"not_rendered":{"charts":0,"images":6,"macros":1,"external_links":1,"defined_names":26,"comments":6,"pivot_tables":0},"unopened":[],"bounds":{"document_bytes":16777216,"sheet_cells":100000,"rows_first":2000,"rows_last":500,"rows_between":2000,"halvings":0,"cell_chars":16384,"cell_head_chars":4096},"cells_cut":0,"cells_raw":0,"read":"whole","date_system":"1900"}

{"sheet":"ETAPE 1","index":0,"n_rows":41,"n_cols":2,"rows_kept":41,"cut":false,"hidden":false,"merged":[[19,15,23,15],[24,0,24,14],[6,0,7,14],[10,0,10,2],[10,3,10,14],[11,0,11,2],[11,3,11,14],[13,0,13,2],[13,3,13,14],[9,0,9,14],[14,0,14,2],[14,3,14,14],[15,0,15,2],[15,3,15,14],[12,0,12,2],[12,3,12,14],[16,0,16,2],[16,3,16,14],[18,0,18,14],[47,0,47,14],[25,0,25,14],[26,0,26,14],[27,0,27,14],[28,0,28,14],[29,0,29,14],[31,0,31,14],[40,0,40,14],[42,0,42,14],[45,0,45,14],[46,0,46,14],[30,0,30,14],[45,15,45,29],[46,15,46,29],[47,15,47,29],[32,0,32,14],[41,15,41,29],[44,15,44,29],[42,15,42,29],[43,15,43,29]]}
[]
[null,1]
[]
[]
[]
[]
["DOSSIER FINANCIER"]
[]
[]
["COORDONNEES DU PROJET"]
["Bénéficiaire (asbl) :"]
["Nom du projet :"]
["Brève description du projet :"]
["Gestionnaire financièr du projet : "]
["Numéro de téléphone : "]
["Mail :"]
["N° compte bancaire :"]
[]
["ATTENTION ! Si l'ALERTE DE SECURITE est visible, veuillez cliquer sur 'activer le contenu' "]
[]
[]
[]
[]
[]
["QUE SOUHAITEZ-VOUS FAIRE MAINTENANT ?"]
["← cliquez sur le bouton"]
["← cliquez sur le bouton"]
["← cliquez sur le bouton"]
["← cliquez sur le bouton"]
["← cliquez sur le bouton"]
["← cliquez sur le bouton"]
["← cliquez sur le bouton"]
["← cliquez sur le bouton"]
[]
[]
[]
[]
[]
[]
[]
["PARTIE FEDASIL"]

{"sheet":"Questions suppl Rapp FIN","index":1,"n_rows":596,"n_cols":5,"rows_kept":596,"cut":false,"hidden":true,"merged":[[229,0,229,8],[230,0,230,8],[231,0,231,8],[232,0,232,8],[233,0,233,8],[234,0,234,8],[235,0,235,8],[224,0,224,8],[225,0,225,8],[226,0,226,8],[227,0,227,8],[228,0,228,8],[199,0,199,8],[200,0,200,8],[201,0,201,8],[214,0,214,8],[215,0,215,8],[216,0,216,8],[217,0,217,8],[218,0,218,8],[202,0,202,8],[203,0,203,8],[204,0,204,8],[205,0,205,8],[206,0,206,8],[207,0,207,8],[208,0,208,8],[209,0,209,8],[210,0,210,8],[11,0,11,8],[12,0,12,8],[13,0,13,8],[14,0,14,8],[15,0,15,8],[16,0,16,8],[2,0,2,1],[2,2,2,8],[3,0,4,8],[8,0,8,8],[9,0,9,8],[10,0,10,8],[28,0,28,8],[29,0,29,8],[30,0,30,8],[31,0,31,8],[32,0,32,8],[33,0,33,8],[17,0,17,8],[23,0,23,8],[24,0,24,8],[25,0,25,8],[26,0,26,8],[27,0,27,8],[40,0,40,8],[41,0,41,8],[42,0,42,8],[43,0,43,8],[44,0,44,8],[45,0,45,8],[34,0,34,8],[35,0,35,8],[36,0,36,8],[37,0,37,8],[38,0,38,8],[39,0,39,8],[52,0,52,8],[53,0,53,8],[54,0,54,8],[55,0,55,8],[56,0,56,8],[57,0,57,8],[46,0,46,8],[47,0,47,8],[48,0,48,8],[49,0,49,8],[50,0,50,8],[51,0,51,8],[64,0,64,8],[65,0,65,8],[66,0,66,8],[67,0,67,8],[68,0,68,8],[69,0,69,8],[58,0,58,8],[59,0,59,8],[60,0,60,8],[61,0,61,8],[62,0,62,8],[63,0,63,8],[76,0,76,8],[77,0,77,8],[78,0,78,8],[79,0,79,8],[80,0,80,8],[81,0,81,8],[70,0,70,8],[71,0,71,8],[72,0,72,8],[73,0,73,8],[74,0,74,8],[75,0,75,8],[88,0,88,8],[89,0,89,8],[90,0,90,8],[91,0,91,8],[92,0,92,8],[93,0,93,8],[82,0,82,8],[83,0,83,8],[84,0,84,8],[85,0,85,8],[86,0,86,8],[87,0,87,8],[100,0,100,8],[101,0,101,8],[102,0,102,8],[103,0,103,8],[104,0,104,8],[105,0,105,8],[94,0,94,8],[95,0,95,8],[96,0,96,8],[97,0,97,8],[98,0,98,8],[99,0,99,8],[112,0,112,8],[113,0,113,8],[114,0,114,8],[115,0,115,8],[116,0,116,8],[117,0,117,8],[106,0,106,8],[107,0,107,8],[108,0,108,8],[109,0,109,8],[110,0,110,8],[111,0,111,8],[124,0,124,8],[125,0,125,8],[126,0,126,8],[127,0,127,8],[128,0,128,8],[129,0,129,8],[118,0,118,8],[119,0,119,8],[120,0,120,8],[121,0,121,8],[122,0,122,8],[123,0,123,8],[136,0,136,8],[137,0,137,8],[138,0,138,8],[139,0,139,8],[140,0,140,8],[141,0,141,8],[130,0,130,8],[131,0,131,8],[132,0,132,8],[133,0,133,8],[134,0,134,8],[135,0,135,8],[148,0,148,8],[149,0,149,8],[150,0,150,8],[151,0,151,8],[152,0,152,8],[153,0,153,8],[142,0,142,8],[143,0,143,8],[144,0,144,8],[145,0,145,8],[146,0,146,8],[147,0,147,8],[163,0,163,8],[164,0,164,8],[165,0,165,8],[166,0,166,8],[167,0,167,8],[168,0,168,8],[154,0,154,8],[155,0,155,8],[159,0,159,8],[160,0,160,8],[161,0,161,8],[162,0,162,8],[169,0,169,8],[170,0,170,8],[171,0,171,8],[172,0,172,8],[173,0,173,8],[174,0,174,8],[175,0,175,8],[176,0,176,8],[177,0,177,8],[178,0,178,8],[179,0,179,8],[180,0,180,8],[181,0,181,8],[182,0,182,8],[183,0,183,8],[236,0,236,8],[240,0,240,8],[241,0,241,8],[184,0,184,8],[185,0,185,8],[186,0,186,8],[187,0,187,8],[188,0,188,8],[189,0,189,8],[190,0,190,8],[191,0,191,8],[192,0,192,8],[193,0,193,8],[194,0,194,8],[195,0,195,8],[196,0,196,8],[197,0,197,8],[198,0,198,8],[242,0,242,8],[249,0,249,8],[250,0,250,8],[251,0,251,8],[252,0,252,8],[256,0,256,8],[257,0,257,8],[243,0,243,8],[244,0,244,8],[245,0,245,8],[246,0,246,8],[247,0,247,8],[248,0,248,8],[264,0,264,8],[265,0,265,8],[266,0,266,8],[267,0,267,8],[268,0,268,8],[272,0,272,8],[258,0,258,8],[259,0,259,8],[260,0,260,8],[261,0,261,8],[262,0,262,8],[263,0,263,8],[279,0,279,8],[280,0,280,8],[281,0,281,8],[282,0,282,8],[283,0,283,8],[284,0,284,8],[273,0,273,8],[274,0,274,8],[275,0,275,8],[276,0,276,8],[277,0,277,8],[278,0,278,8],[294,0,294,8],[295,0,295,8],[296,0,296,8],[297,0,297,8],[298,0,298,8],[299,0,299,8],[288,0,288,8],[289,0,289,8],[290,0,290,8],[291,0,291,8],[292,0,292,8],[293,0,293,8],[309,0,309,8],[310,0,310,8],[311,0,311,8],[312,0,312,8],[313,0,313,8],[314,0,314,8],[300,0,300,8],[304,0,304,8],[305,0,305,8],[306,0,306,8],[307,0,307,8],[308,0,308,8],[324,0,324,8],[325,0,325,8],[326,0,326,8],[327,0,327,8],[328,0,328,8],[329,0,329,8],[315,0,315,8],[316,0,316,8],[320,0,320,8],[321,0,321,8],[322,0,322,8],[323,0,323,8],[339,0,339,8],[340,0,340,8],[341,0,341,8],[342,0,342,8],[343,0,343,8],[344,0,344,8],[330,0,330,8],[331,0,331,8],[332,0,332,8],[336,0,336,8],[337,0,337,8],[338,0,338,8],[354,0,354,8],[355,0,355,8],[356,0,356,8],[357,0,357,8],[358,0,358,8],[359,0,359,8],[345,0,345,8],[346,0,346,8],[347,0,347,8],[348,0,348,8],[352,0,352,8],[353,0,353,8],[369,0,369,8],[370,0,370,8],[371,0,371,8],[372,0,372,8],[373,0,373,8],[374,0,374,8],[360,0,360,8],[361,0,361,8],[362,0,362,8],[363,0,363,8],[364,0,364,8],[368,0,368,8],[384,0,384,8],[385,0,385,8],[386,0,386,8],[387,0,387,8],[388,0,388,8],[389,0,389,8],[375,0,375,8],[376,0,376,8],[377,0,377,8],[378,0,378,8],[379,0,379,8],[380,0,380,8],[396,0,396,8],[397,0,397,8],[403,0,403,8],[404,0,404,8],[405,0,405,8],[406,0,406,8],[390,0,390,8],[391,0,391,8],[392,0,392,8],[393,0,393,8],[394,0,394,8],[395,0,395,8],[413,0,413,8],[414,0,414,8],[415,0,415,8],[419,0,419,8],[420,0,420,8],[421,0,421,8],[407,0,407,8],[408,0,408,8],[409,0,409,8],[410,0,410,8],[411,0,411,8],[412,0,412,8],[428,0,428,8],[429,0,429,8],[430,0,430,8],[431,0,431,8],[435,0,435,8],[436,0,436,8],[422,0,422,8],[423,0,423,8],[424,0,424,8],[425,0,425,8],[426,0,426,8],[427,0,427,8],[443,0,443,8],[444,0,444,8],[445,0,445,8],[446,0,446,8],[447,0,447,8],[451,0,451,8],[437,0,437,8],[438,0,438,8],[439,0,439,8],[440,0,440,8],[441,0,441,8],[442,0,442,8],[458,0,458,8],[459,0,459,8],[460,0,460,8],[461,0,461,8],[462,0,462,8],[463,0,463,8],[452,0,452,8],[453,0,453,8],[454,0,454,8],[455,0,455,8],[456,0,456,8],[457,0,457,8],[473,0,473,8],[474,0,474,8],[475,0,475,8],[476,0,476,8],[477,0,477,8],[478,0,478,8],[467,0,467,8],[468,0,468,8],[469,0,469,8],[470,0,470,8],[471,0,471,8],[472,0,472,8],[488,0,488,8],[489,0,489,8],[490,0,490,8],[491,0,491,8],[492,0,492,8],[493,0,493,8],[479,0,479,8],[483,0,483,8],[484,0,484,8],[485,0,485,8],[486,0,486,8],[487,0,487,8],[503,0,503,8],[504,0,504,8],[505,0,505,8],[506,0,506,8],[507,0,507,8],[508,0,508,8],[494,0,494,8],[495,0,495,8],[499,0,499,8],[500,0,500,8],[501,0,501,8],[502,0,502,8],[518,0,518,8],[519,0,519,8],[520,0,520,8],[521,0,521,8],[522,0,522,8],[523,0,523,8],[509,0,509,8],[510,0,510,8],[511,0,511,8],[515,0,515,8],[516,0,516,8],[517,0,517,8],[533,0,533,8],[534,0,534,8],[535,0,535,8],[536,0,536,8],[537,0,537,8],[538,0,538,8],[524,0,524,8],[525,0,525,8],[526,0,526,8],[527,0,527,8],[531,0,531,8],[532,0,532,8],[548,0,548,8],[549,0,549,8],[550,0,550,8],[551,0,551,8],[552,0,552,8],[553,0,553,8],[539,0,539,8],[540,0,540,8],[541,0,541,8],[542,0,542,8],[543,0,543,8],[547,0,547,8],[563,0,563,8],[564,0,564,8],[565,0,565,8],[566,0,566,8],[567,0,567,8],[568,0,568,8],[554,0,554,8],[555,0,555,8],[556,0,556,8],[557,0,557,8],[558,0,558,8],[559,0,559,8],[575,0,575,8],[579,0,579,8],[580,0,580,8],[581,0,581,8],[582,0,582,8],[583,0,583,8],[569,0,569,8],[570,0,570,8],[571,0,571,8],[572,0,572,8],[573,0,573,8],[574,0,574,8],[590,0,590,8],[591,0,591,8],[592,0,592,8],[595,4,595,8],[584,0,584,8],[585,0,585,8],[586,0,586,8],[587,0,587,8],[588,0,588,8],[589,0,589,8]]}
[]
[]
[{"$f":"'BUDGET AJU APPROUVE'!I3","v":"2021/XX"},null,{"$f":"'ETAPE 1'!D11","v":0}]
["Questions supplémentaires cf rapport financier intermédiaire ou final"]
[]
[]
["QUESTIONS GENERALES"]
[]
["A.1. Merci de xx, svp. "]
["A.2. Merci de xx, svp. "]
["A.3. Merci de xx, svp. "]
["A.4. Merci de xx, svp. "]
["A.5. Merci de xx, svp. "]
["A.6. Merci de xx, svp. "]
["A.7. Merci de xx, svp. "]
["A.8. Merci de xx, svp. "]
["A.9. Merci de xx, svp. "]
["A.10. Merci de xx, svp. "]
[]
["QUESTIONS SPECIFIQUES PAR RUBRIQUE DE FRAIS"]
[]
["FRAIS DE PERSONNEL:"]
[]
[{"$f":"'Frais de personnel'!B6","v":"(nom à compléter)"}]
[{"$f":"IF('Frais de personnel'!V6=0, \"Pas de questions ou d'autres remarques\",'Frais de personnel'!V6)","v":"Pas de questions ou d'autres remarques"}]
[{"$f":"IF('Frais de personnel'!V7=0, \"Pas de questions ou d'autres remarques\",'Frais de personnel'!V7)","v":"Pas de questions ou d'autres remarques"}]
[{"$f":"IF('Frais de personnel'!V8=0, \"Pas de questions ou d'autres remarques\",'Frais de personnel'!V8)","v":"Pas de questions ou d'autres remarques"}]
[{"$f":"IF('Frais de personnel'!V9=0, \"Pas de questions ou d'autres remarques\",'Frais de personnel'!V9)","v":"Pas de questions ou d'autres remarques"}]
[{"$f":"IF('Frais de personnel'!V10=0, \"Pas de questions ou d'autres remarques\",'Frais de personnel'!V10)","v":"Pas de questions ou d'autres remarques"}]
[{"$f":"IF('Frais de personnel'!V11=0, \"Pas de questions ou d'autres remarques\",'Frais de personnel'!V11)","v":"Pas de questions ou d'autres remarques"}]
[{"$f":"IF('Frais de personnel'!V12=0, \"Pas de questions ou d'autres remarques\",'Frais de personnel'!V12)","v":"Pas de questions ou d'autres remarques"}]
[{"$f":"IF('Frais de personnel'!V13=0, \"Pas de questions ou d'autres remarques\",'Frais de personnel'!V13)","v":"Pas de questions ou d'autres remarques"}]
[{"$f":"IF('Frais de personnel'!V14=0, \"Pas de questions ou d'autres remarques\",'Frais de personnel'!V14)","v":"Pas de questions ou d'autres remarques"}]
[{"$f":"IF('Frais de personnel'!V15=0, \"Pas de questions ou d'autres remarques\",'Frais de personnel'!V15)","v":"Pas de questions ou d'autres remarques"}]
[{"$f":"IF('Frais de personnel'!V16=0, \"Pas de questions ou d'autres remarques\",'Frais de personnel'!V16)","v":"Pas de questions ou d'autres remarques"}]
[{"$f":"IF('Frais de personnel'!V17=0, \"Pas de questions ou d'autres remarques\",'Frais de personnel'!V17)","v":"Pas de questions ou d'autres remarques"}]
[{"$f":"IF('Frais de personnel'!V18=0, \"Pas de questions ou d'autres remarques\",'Frais de personnel'!V18)","v":"Pas de questions ou d'autres remarques"}]
[{"$f":"IF('Frais de personnel'!V19=0, \"Pas de questions ou d'autres remarques\",'Frais de personnel'!V19)","v":"Pas de questions ou d'autres remarques"}]
[{"$f":"IF('Frais de personnel'!V20=0, \"Pas de questions ou d'autres remarques\",'Frais de personnel'!V20)","v":"Pas de questions ou d'autres remarques"}]
[{"$f":"IF('Frais de personnel'!V21=0, \"Pas de questions ou d'autres remarques\",'Frais de personnel'!V21)","v":"Pas de questions ou d'autres remarques"}]
[{"$f":"'Frais de personnel'!B22","v":"(nom à compléter)"}]
[{"$f":"IF('Frais de personnel'!V22=0, \"Pas de questions ou d'autres remarques\",'Frais de personnel'!V22)","v":"Pas de questions ou d'autres remarques"}]
[{"$f":"IF('Frais de personnel'!V23=0, \"Pas de questions ou d'autres remarques\",'Frais de personnel'!V23)","v":"Pas de questions ou d'autres remarques"}]
[{"$f":"IF('Frais de personnel'!V24=0, \"Pas de questions ou d'autres remarques\",'Frais de personnel'!V24)","v":"Pas de questions ou d'autres remarques"}]
[{"$f":"IF('Frais de personnel'!V25=0, \"Pas de questions ou d'autres remarques\",'Frais de personnel'!V25)","v":"Pas de questions ou d'autres remarques"}]
[{"$f":"IF('Frais de personnel'!V26=0, \"Pas de questions ou d'autres remarques\",'Frais de personnel'!V26)","v":"Pas de questions ou d'autres remarques"}]
[{"$f":"IF('Frais de personnel'!V27=0, \"Pas de questions ou d'autres remarques\",'Frais de personnel'!V27)","v":"Pas de questions ou d'autres remarques"}]
[{"$f":"IF('Frais de personnel'!V28=0, \"Pas de questions ou d'autres remarques\",'Frais de personnel'!V28)","v":"Pas de questions ou d'autres remarques"}]
[{"$f":"IF('Frais de personnel'!V29=0, \"Pas de questions ou d'autres remarques\",'Frais de personnel'!V29)","v":"Pas de questions ou d'autres remarques"}]
[{"$f":"IF('Frais de personnel'!V30=0, \"Pas de questions ou d'autres remarques\",'Frais de personnel'!V30)","v":"Pas de questions ou d'autres remarques"}]
[{"$f":"IF('Frais de personnel'!V31=0, \"Pas de questions ou d'autres remarques\",'Frais de personnel'!V31)","v":"Pas de questions ou d'autres remarques"}]
[{"$f":"IF('Frais de personnel'!V32=0, \"Pas de questions ou d'autres remarques\",'Frais de personnel'!V32)","v":"Pas de questions ou d'autres remarques"}]
[{"$f":"IF('Frais de personnel'!V33=0, \"Pas de questions ou d'autres remarques\",'Frais de personnel'!V33)","v":"Pas de questions ou d'autres remarques"}]
[{"$f":"IF('Frais de personnel'!V34=0, \"Pas de questions ou d'autres remarques\",'Frais de personnel'!V34)","v":"Pas de questions ou d'autres remarques"}]
[{"$f":"IF('Frais de personnel'!V35=0, \"Pas de questions ou d'autres remarques\",'Frais de personnel'!V35)","v":"Pas de questions ou d'autres remarques"}]
[{"$f":"IF('Frais de personnel'!V36=0, \"Pas de questions ou d'autres remarques\",'Frais de personnel'!V36)","v":"Pas de questions ou d'autres remarques"}]
[{"$f":"IF('Frais de personnel'!V37=0, \"Pas de questions ou d'autres remarques\",'Frais de personnel'!V37)","v":"Pas de questions ou d'autres remarques"}]
[{"$f":"'Frais de personnel'!B38","v":"(nom à compléter)"}]
[{"$f":"IF('Frais de personnel'!V38=0, \"Pas de questions ou d'autres remarques\",'Frais de personnel'!V38)","v":"Pas de questions ou d'autres remarques"}]
[{"$f":"IF('Frais de personnel'!V39=0, \"Pas de questions ou d'autres remarques\",'Frais de personnel'!V39)","v":"Pas de questions ou d'autres remarques"}]
[{"$f":"IF('Frais de personnel'!V40=0, \"Pas de questions ou d'autres remarques\",'Frais de personnel'!V40)","v":"Pas de questions ou d'autres remarques"}]
[{"$f":"IF('Frais de personnel'!V41=0, \"Pas de questions ou d'autres remarques\",'Frais de personnel'!V41)","v":"Pas de questions ou d'autres remarques"}]
[{"$f":"IF('Frais de personnel'!V42=0, \"Pas de questions ou d'autres remarques\",'Frais de personnel'!V42)","v":"Pas de questions ou d'autres remarques"}]
[{"$f":"IF('Frais de personnel'!V43=0, \"Pas de questions ou d'autres remarques\",'Frais de personnel'!V43)","v":"Pas de questions ou d'autres remarques"}]
[{"$f":"IF('Frais de personnel'!V44=0, \"Pas de questions ou d'autres remarques\",'Frais de personnel'!V44)","v":"Pas de questions ou d'autres remarques"}]
[{"$f":"IF('Frais de personnel'!V45=0, \"Pas de questions ou d'autres remarques\",'Frais de personnel'!V45)","v":"Pas de questions ou d'autres remarques"}]
[{"$f":"IF('Frais de personnel'!V46=0, \"Pas de questions ou d'autres remarques\",'Frais de personnel'!V46)","v":"Pas de questions ou d'autres remarques"}]
[{"$f":"IF('Frais de personnel'!V47=0, \"Pas de questions ou d'autres remarques\",'Frais de personnel'!V47)","v":"Pas de questions ou d'autres remarques"}]
[{"$f":"IF('Frais de personnel'!V48=0, \"Pas de questions ou d'autres remarques\",'Frais de personnel'!V48)","v":"Pas de questions ou d'autres remarques"}]
[{"$f":"IF('Frais de personnel'!V49=0, \"Pas de questions ou d'autres remarques\",'Frais de personnel'!V49)","v":"Pas de questions ou d'autres remarques"}]
[{"$f":"IF('Frais de personnel'!V50=0, \"Pas de questions ou d'autres remarques\",'Frais de personnel'!V50)","v":"Pas de questions ou d'autres remarques"}]
[{"$f":"IF('Frais de personnel'!V51=0, \"Pas de questions ou d'autres remarques\",'Frais de personnel'!V51)","v":"Pas de questions ou d'autres remarques"}]
[{"$f":"IF('Frais de personnel'!V52=0, \"Pas de questions ou d'autres remarques\",'Frais de personnel'!V52)","v":"Pas de questions ou d'autres remarques"}]
[{"$f":"IF('Frais de personnel'!V53=0, \"Pas de questions ou d'autres remarques\",'Frais de personnel'!V53)","v":"Pas de questions ou d'autres remarques"}]
[{"$f":"'Frais de personnel'!B54","v":"(nom à compléter)"}]
[{"$f":"IF('Frais de personnel'!V54=0, \"Pas de questions ou d'autres remarques\",'Frais de personnel'!V54)","v":"Pas de questions ou d'autres remarques"}]
[{"$f":"IF('Frais de personnel'!V55=0, \"Pas de questions ou d'autres remarques\",'Frais de personnel'!V55)","v":"Pas de questions ou d'autres remarques"}]
[{"$f":"IF('Frais de personnel'!V56=0, \"Pas de questions ou d'autres remarques\",'Frais de personnel'!V56)","v":"Pas de questions ou d'autres remarques"}]
[{"$f":"IF('Frais de personnel'!V57=0, \"Pas de questions ou d'autres remarques\",'Frais de personnel'!V57)","v":"Pas de questions ou d'autres remarques"}]
[{"$f":"IF('Frais de personnel'!V58=0, \"Pas de questions ou d'autres remarques\",'Frais de personnel'!V58)","v":"Pas de questions ou d'autres remarques"}]
[{"$f":"IF('Frais de personnel'!V59=0, \"Pas de questions ou d'autres remarques\",'Frais de personnel'!V59)","v":"Pas de questions ou d'autres remarques"}]
[{"$f":"IF('Frais de personnel'!V60=0, \"Pas de questions ou d'autres remarques\",'Frais de personnel'!V60)","v":"Pas de questions ou d'autres remarques"}]
[{"$f":"IF('Frais de personnel'!V61=0, \"Pas de questions ou d'autres remarques\",'Frais de personnel'!V61)","v":"Pas de questions ou d'autres remarques"}]
[{"$f":"IF('Frais de personnel'!V62=0, \"Pas de questions ou d'autres remarques\",'Frais de personnel'!V62)","v":"Pas de questions ou d'autres remarques"}]
[{"$f":"IF('Frais de personnel'!V63=0, \"Pas de questions ou d'autres remarques\",'Frais de personnel'!V63)","v":"Pas de questions ou d'autres remarques"}]
[{"$f":"IF('Frais de personnel'!V64=0, \"Pas de questions ou d'autres remarques\",'Frais de personnel'!V64)","v":"Pas de questions ou d'autres remarques"}]
[{"$f":"IF('Frais de personnel'!V65=0, \"Pas de questions ou d'autres remarques\",'Frais de personnel'!V65)","v":"Pas de questions ou d'autres remarques"}]
[{"$f":"IF('Frais de personnel'!V66=0, \"Pas de questions ou d'autres remarques\",'Frais de personnel'!V66)","v":"Pas de questions ou d'autres remarques"}]
[{"$f":"IF('Frais de personnel'!V67=0, \"Pas de questions ou d'autres remarques\",'Frais de personnel'!V67)","v":"Pas de questions ou d'autres remarques"}]
[{"$f":"IF('Frais de personnel'!V68=0, \"Pas de questions ou d'autres remarques\",'Frais de personnel'!V68)","v":"Pas de questions ou d'autres remarques"}]
[{"$f":"IF('Frais de personnel'!V69=0, \"Pas de questions ou d'autres remarques\",'Frais de personnel'!V69)","v":"Pas de questions ou d'autres remarques"}]
[{"$f":"'Frais de personnel'!B70","v":"(nom à compléter)"}]
[{"$f":"IF('Frais de personnel'!V70=0, \"Pas de questions ou d'autres remarques\",'Frais de personnel'!V70)","v":"Pas de questions ou d'autres remarques"}]
[{"$f":"IF('Frais de personnel'!V71=0, \"Pas de questions ou d'autres remarques\",'Frais de personnel'!V71)","v":"Pas de questions ou d'autres remarques"}]
[{"$f":"IF('Frais de personnel'!V72=0, \"Pas de questions ou d'autres remarques\",'Frais de personnel'!V72)","v":"Pas de questions ou d'autres remarques"}]
[{"$f":"IF('Frais de personnel'!V73=0, \"Pas de questions ou d'autres remarques\",'Frais de personnel'!V73)","v":"Pas de questions ou d'autres remarques"}]
[{"$f":"IF('Frais de personnel'!V74=0, \"Pas de questions ou d'autres remarques\",'Frais de personnel'!V74)","v":"Pas de questions ou d'autres remarques"}]
[{"$f":"IF('Frais de personnel'!V75=0, \"Pas de questions ou d'autres remarques\",'Frais de personnel'!V75)","v":"Pas de questions ou d'autres remarques"}]
[{"$f":"IF('Frais de personnel'!V76=0, \"Pas de questions ou d'autres remarques\",'Frais de personnel'!V76)","v":"Pas de questions ou d'autres remarques"}]
[{"$f":"IF('Frais de personnel'!V77=0, \"Pas de questions ou d'autres remarques\",'Frais de personnel'!V77)","v":"Pas de questions ou d'autres remarques"}]
[{"$f":"IF('Frais de personnel'!V78=0, \"Pas de questions ou d'autres remarques\",'Frais de personnel'!V78)","v":"Pas de questions ou d'autres remarques"}]
[{"$f":"IF('Frais de personnel'!V79=0, \"Pas de questions ou d'autres remarques\",'Frais de personnel'!V79)","v":"Pas de questions ou d'autres remarques"}]
[{"$f":"IF('Frais de personnel'!V80=0, \"Pas de questions ou d'autres remarques\",'Frais de personnel'!V80)","v":"Pas de questions ou d'autres remarques"}]
[{"$f":"IF('Frais de personnel'!V81=0, \"Pas de questions ou d'autres remarques\",'Frais de personnel'!V81)","v":"Pas de questions ou d'autres remarques"}]
[{"$f":"IF('Frais de personnel'!V82=0, \"Pas de questions ou d'autres remarques\",'Frais de personnel'!V82)","v":"Pas de questions ou d'autres remarques"}]
[{"$f":"IF('Frais de personnel'!V83=0, \"Pas de questions ou d'autres remarques\",'Frais de personnel'!V83)","v":"Pas de questions ou d'autres remarques"}]
[{"$f":"IF('Frais de personnel'!V84=0, \"Pas de questions ou d'autres remarques\",'Frais de personnel'!V84)","v":"Pas de questions ou d'autres remarques"}]
[{"$f":"IF('Frais de personnel'!V85=0, \"Pas de questions ou d'autres remarques\",'Frais de personnel'!V85)","v":"Pas de questions ou d'autres remarques"}]
[{"$f":"'Frais de personnel'!B86","v":"(nom à compléter)"}]
[{"$f":"IF('Frais de personnel'!V86=0, \"Pas de questions ou d'autres remarques\",'Frais de personnel'!V86)","v":"Pas de questions ou d'autres remarques"}]
[{"$f":"IF('Frais de personnel'!V87=0, \"Pas de questions ou d'autres remarques\",'Frais de personnel'!V87)","v":"Pas de questions ou d'autres remarques"}]
[{"$f":"IF('Frais de personnel'!V88=0, \"Pas de questions ou d'autres remarques\",'Frais de personnel'!V88)","v":"Pas de questions ou d'autres remarques"}]
[{"$f":"IF('Frais de personnel'!V89=0, \"Pas de questions ou d'autres remarques\",'Frais de personnel'!V89)","v":"Pas de questions ou d'autres remarques"}]
[{"$f":"IF('Frais de personnel'!V90=0, \"Pas de questions ou d'autres remarques\",'Frais de personnel'!V90)","v":"Pas de questions ou d'autres remarques"}]
[{"$f":"IF('Frais de personnel'!V91=0, \"Pas de questions ou d'autres remarques\",'Frais de personnel'!V91)","v":"Pas de questions ou d'autres remarques"}]
[{"$f":"IF('Frais de personnel'!V92=0, \"Pas de questions ou d'autres remarques\",'Frais de personnel'!V92)","v":"Pas de questions ou d'autres remarques"}]
[{"$f":"IF('Frais de personnel'!V93=0, \"Pas de questions ou d'autres remarques\",'Frais de personnel'!V93)","v":"Pas de questions ou d'autres remarques"}]
[{"$f":"IF('Frais de personnel'!V94=0, \"Pas de questions ou d'autres remarques\",'Frais de personnel'!V94)","v":"Pas de questions ou d'autres remarques"}]
[{"$f":"IF('Frais de personnel'!V95=0, \"Pas de questions ou d'autres remarques\",'Frais de personnel'!V95)","v":"Pas de questions ou d'autres remarques"}]
[{"$f":"IF('Frais de personnel'!V96=0, \"Pas de questions ou d'autres remarques\",'Frais de personnel'!V96)","v":"Pas de questions ou d'autres remarques"}]
[{"$f":"IF('Frais de personnel'!V97=0, \"Pas de questions ou d'autres remarques\",'Frais de personnel'!V97)","v":"Pas de questions ou d'autres remarques"}]
[{"$f":"IF('Frais de personnel'!V98=0, \"Pas de questions ou d'autres remarques\",'Frais de personnel'!V98)","v":"Pas de questions ou d'autres remarques"}]
[{"$f":"IF('Frais de personnel'!V99=0, \"Pas de questions ou d'autres remarques\",'Frais de personnel'!V99)","v":"Pas de questions ou d'autres remarques"}]
[{"$f":"IF('Frais de personnel'!V100=0, \"Pas de questions ou d'autres remarques\",'Frais de personnel'!V100)","v":"Pas de questions ou d'autres remarques"}]
[{"$f":"IF('Frais de personnel'!V101=0, \"Pas de questions ou d'autres remarques\",'Frais de personnel'!V101)","v":"Pas de questions ou d'autres remarques"}]
[{"$f":"'Frais de personnel'!B102","v":"(nom à compléter)"}]
[{"$f":"IF('Frais de personnel'!V102=0, \"Pas de questions ou d'autres remarques\",'Frais de personnel'!V102)","v":"Pas de questions ou d'autres remarques"}]
[{"$f":"IF('Frais de personnel'!V103=0, \"Pas de questions ou d'autres remarques\",'Frais de personnel'!V103)","v":"Pas de questions ou d'autres remarques"}]
[{"$f":"IF('Frais de personnel'!V104=0, \"Pas de questions ou d'autres remarques\",'Frais de personnel'!V104)","v":"Pas de questions ou d'autres remarques"}]
[{"$f":"IF('Frais de personnel'!V105=0, \"Pas de questions ou d'autres remarques\",'Frais de personnel'!V105)","v":"Pas de questions ou d'autres remarques"}]
[{"$f":"IF('Frais de personnel'!V106=0, \"Pas de questions ou d'autres remarques\",'Frais de personnel'!V106)","v":"Pas de questions ou d'autres remarques"}]
[{"$f":"IF('Frais de personnel'!V107=0, \"Pas de questions ou d'autres remarques\",'Frais de personnel'!V107)","v":"Pas de questions ou d'autres remarques"}]
[{"$f":"IF('Frais de personnel'!V108=0, \"Pas de questions ou d'autres remarques\",'Frais de personnel'!V108)","v":"Pas de questions ou d'autres remarques"}]
[{"$f":"IF('Frais de personnel'!V109=0, \"Pas de questions ou d'autres remarques\",'Frais de personnel'!V109)","v":"Pas de questions ou d'autres remarques"}]
[{"$f":"IF('Frais de personnel'!V110=0, \"Pas de questions ou d'autres remarques\",'Frais de personnel'!V110)","v":"Pas de questions ou d'autres remarques"}]
[{"$f":"IF('Frais de personnel'!V111=0, \"Pas de questions ou d'autres remarques\",'Frais de personnel'!V111)","v":"Pas de questions ou d'autres remarques"}]
[{"$f":"IF('Frais de personnel'!V112=0, \"Pas de questions ou d'autres remarques\",'Frais de personnel'!V112)","v":"Pas de questions ou d'autres remarques"}]
[{"$f":"IF('Frais de personnel'!V113=0, \"Pas de questions ou d'autres remarques\",'Frais de personnel'!V113)","v":"Pas de questions ou d'autres remarques"}]
[{"$f":"IF('Frais de personnel'!V114=0, \"Pas de questions ou d'autres remarques\",'Frais de personnel'!V114)","v":"Pas de questions ou d'autres remarques"}]
[{"$f":"IF('Frais de personnel'!V115=0, \"Pas de questions ou d'autres remarques\",'Frais de personnel'!V115)","v":"Pas de questions ou d'autres remarques"}]
[{"$f":"IF('Frais de personnel'!V116=0, \"Pas de questions ou d'autres remarques\",'Frais de personnel'!V116)","v":"Pas de questions ou d'autres remarques"}]
[{"$f":"'Frais de personnel'!B118","v":"(nom à compléter)"}]
[{"$f":"IF('Frais de personnel'!V118=0, \"Pas de questions ou d'autres remarques\",'Frais de personnel'!V118)","v":"Pas de questions ou d'autres remarques"}]
[{"$f":"IF('Frais de personnel'!V119=0, \"Pas de questions ou d'autres remarques\",'Frais de personnel'!V119)","v":"Pas de questions ou d'autres remarques"}]
[{"$f":"IF('Frais de personnel'!V120=0, \"Pas de questions ou d'autres remarques\",'Frais de personnel'!V120)","v":"Pas de questions ou d'autres remarques"}]
[{"$f":"IF('Frais de personnel'!V121=0, \"Pas de questions ou d'autres remarques\",'Frais de personnel'!V121)","v":"Pas de questions ou d'autres remarques"}]
[{"$f":"IF('Frais de personnel'!V122=0, \"Pas de questions ou d'autres remarques\",'Frais de personnel'!V122)","v":"Pas de questions ou d'autres remarques"}]
[{"$f":"IF('Frais de personnel'!V123=0, \"Pas de questions ou d'autres remarques\",'Frais de personnel'!V123)","v":"Pas de questions ou d'autres remarques"}]
[{"$f":"IF('Frais de personnel'!V124=0, \"Pas de questions ou d'autres remarques\",'Frais de personnel'!V124)","v":"Pas de questions ou d'autres remarques"}]
[{"$f":"IF('Frais de personnel'!V125=0, \"Pas de questions ou d'autres remarques\",'Frais de personnel'!V125)","v":"Pas de questions ou d'autres remarques"}]
[{"$f":"IF('Frais de personnel'!V126=0, \"Pas de questions ou d'autres remarques\",'Frais de personnel'!V126)","v":"Pas de questions ou d'autres remarques"}]
[{"$f":"IF('Frais de personnel'!V127=0, \"Pas de questions ou d'autres remarques\",'Frais de personnel'!V127)","v":"Pas de questions ou d'autres remarques"}]
[{"$f":"IF('Frais de personnel'!V128=0, \"Pas de questions ou d'autres remarques\",'Frais de personnel'!V128)","v":"Pas de questions ou d'autres remarques"}]
[{"$f":"IF('Frais de personnel'!V129=0, \"Pas de questions ou d'autres remarques\",'Frais de personnel'!V129)","v":"Pas de questions ou d'autres remarques"}]
[{"$f":"IF('Frais de personnel'!V130=0, \"Pas de questions ou d'autres remarques\",'Frais de personnel'!V130)","v":"Pas de questions ou d'autres remarques"}]
[{"$f":"IF('Frais de personnel'!V131=0, \"Pas de questions ou d'autres remarques\",'Frais de personnel'!V131)","v":"Pas de questions ou d'autres remarques"}]
[]
["LOCATION:"]
[]
[{"$f":"IF(Location!O6=0, \"Pas de questions ou d'autres remarques\",Location!O6)","v":"Pas de questions ou d'autres remarques"}]
[{"$f":"IF(Location!O7=0, \"Pas de questions ou d'autres remarques\",Location!O7)","v":"Pas de questions ou d'autres remarques"}]
[{"$f":"IF(Location!O8=0, \"Pas de questions ou d'autres remarques\",Location!O8)","v":"Pas de questions ou d'autres remarques"}]
[{"$f":"IF(Location!O9=0, \"Pas de questions ou d'autres remarques\",Location!O9)","v":"Pas de questions ou d'autres remarques"}]
[{"$f":"IF(Location!O10=0, \"Pas de questions ou d'autres remarques\",Location!O10)","v":"Pas de questions ou d'autres remarques"}]
[{"$f":"IF(Location!O11=0, \"Pas de questions ou d'autres remarques\",Location!O11)","v":"Pas de questions ou d'autres remarques"}]
[{"$f":"IF(Location!O12=0, \"Pas de questions ou d'autres remarques\",Location!O12)","v":"Pas de questions ou d'autres remarques"}]
[{"$f":"IF(Location!O13=0, \"Pas de questions ou d'autres remarques\",Location!O13)","v":"Pas de questions ou d'autres remarques"}]
[{"$f":"IF(Location!O14=0, \"Pas de questions ou d'autres remarques\",Location!O14)","v":"Pas de questions ou d'autres remarques"}]
[{"$f":"IF(Location!O15=0, \"Pas de questions ou d'autres remarques\",Location!O15)","v":"Pas de questions ou d'autres remarques"}]
[{"$f":"IF(Location!O16=0, \"Pas de questions ou d'autres remarques\",Location!O16)","v":"Pas de questions ou d'autres remarques"}]
[{"$f":"IF(Location!O17=0, \"Pas de questions ou d'autres remarques\",Location!O17)","v":"Pas de questions ou d'autres remarques"}]
[{"$f":"IF(Location!O18=0, \"Pas de questions ou d'autres remarques\",Location!O18)","v":"Pas de questions ou d'autres remarques"}]
[{"$f":"IF(Location!O19=0, \"Pas de questions ou d'autres remarques\",Location!O19)","v":"Pas de questions ou d'autres remarques"}]
[{"$f":"IF(Location!O20=0, \"Pas de questions ou d'autres remarques\",Location!O20)","v":"Pas de questions ou d'autres remarques"}]
[{"$f":"IF(Location!O21=0, \"Pas de questions ou d'autres remarques\",Location!O21)","v":"Pas de questions ou d'autres remarques"}]
[{"$f":"IF(Location!O22=0, \"Pas de questions ou d'autres remarques\",Location!O22)","v":"Pas de questions ou d'autres remarques"}]
[{"$f":"IF(Location!O23=0, \"Pas de questions ou d'autres remarques\",Location!O23)","v":"Pas de questions ou d'autres remarques"}]
[{"$f":"IF(Location!O24=0, \"Pas de questions ou d'autres remarques\",Location!O24)","v":"Pas de questions ou d'autres remarques"}]
[{"$f":"IF(Location!O25=0, \"Pas de questions ou d'autres remarques\",Location!O25)","v":"Pas de questions ou d'autres remarques"}]
[{"$f":"IF(Location!O26=0, \"Pas de questions ou d'autres remarques\",Location!O26)","v":"Pas de questions ou d'autres remarques"}]
[{"$f":"IF(Location!O27=0, \"Pas de questions ou d'autres remarques\",Location!O27)","v":"Pas de questions ou d'autres remarques"}]
[{"$f":"IF(Location!O28=0, \"Pas de questions ou d'autres remarques\",Location!O28)","v":"Pas de questions ou d'autres remarques"}]
[{"$f":"IF(Location!O29=0, \"Pas de questions ou d'autres remarques\",Location!O29)","v":"Pas de questions ou d'autres remarques"}]
[{"$f":"IF(Location!O30=0, \"Pas de questions ou d'autres remarques\",Location!O30)","v":"Pas de questions ou d'autres remarques"}]
[{"$f":"IF(Location!O31=0, \"Pas de questions ou d'autres remarques\",Location!O31)","v":"Pas de questions ou d'autres remarques"}]
[{"$f":"IF(Location!O32=0, \"Pas de questions ou d'autres remarques\",Location!O32)","v":"Pas de questions ou d'autres remarques"}]
[{"$f":"IF(Location!O33=0, \"Pas de questions ou d'autres remarques\",Location!O33)","v":"Pas de questions ou d'autres remarques"}]
[{"$f":"IF(Location!O34=0, \"Pas de questions ou d'autres remarques\",Location!O34)","v":"Pas de questions ou d'autres remarques"}]
[{"$f":"IF(Location!O35=0, \"Pas de questions ou d'autres remarques\",Location!O35)","v":"Pas de questions ou d'autres remarques"}]
[{"$f":"IF(Location!O36=0, \"Pas de questions ou d'autres remarques\",Location!O36)","v":"Pas de questions ou d'autres remarques"}]
[{"$f":"IF(Location!O37=0, \"Pas de questions ou d'autres remarques\",Location!O37)","v":"Pas de questions ou d'autres remarques"}]
[{"$f":"IF(Location!O38=0, \"Pas de questions ou d'autres remarques\",Location!O38)","v":"Pas de questions ou d'autres remarques"}]
[{"$f":"IF(Location!O39=0, \"Pas de questions ou d'autres remarques\",Location!O39)","v":"Pas de questions ou d'autres remarques"}]
[{"$f":"IF(Location!O40=0, \"Pas de questions ou d'autres remarques\",Location!O40)","v":"Pas de questions ou d'autres remarques"}]
[{"$f":"IF(Location!O41=0, \"Pas de questions ou d'autres remarques\",Location!O41)","v":"Pas de questions ou d'autres remarques"}]
[{"$f":"IF(Location!O42=0, \"Pas de questions ou d'autres remarques\",Location!O42)","v":"Pas de questions ou d'autres remarques"}]
[{"$f":"IF(Location!O43=0, \"Pas de questions ou d'autres remarques\",Location!O43)","v":"Pas de questions ou d'autres remarques"}]
[{"$f":"IF(Location!O44=0, \"Pas de questions ou d'autres remarques\",Location!O44)","v":"Pas de questions ou d'autres remarques"}]
[{"$f":"IF(Location!O45=0, \"Pas de questions ou d'autres remarques\",Location!O45)","v":"Pas de questions ou d'autres remarques"}]
[{"$f":"IF(Location!O46=0, \"Pas de questions ou d'autres remarques\",Location!O46)","v":"Pas de questions ou d'autres remarques"}]
[{"$f":"IF(Location!O47=0, \"Pas de questions ou d'autres remarques\",Location!O47)","v":"Pas de questions ou d'autres remarques"}]
[{"$f":"IF(Location!O48=0, \"Pas de questions ou d'autres remarques\",Location!O48)","v":"Pas de questions ou d'autres remarques"}]
[{"$f":"IF(Location!O49=0, \"Pas de questions ou d'autres remarques\",Location!O49)","v":"Pas de questions ou d'autres remarques"}]
[{"$f":"IF(Location!O50=0, \"Pas de questions ou d'autres remarques\",Location!O50)","v":"Pas de questions ou d'autres remarques"}]
[{"$f":"IF(Location!O51=0, \"Pas de questions ou d'autres remarques\",Location!O51)","v":"Pas de questions ou d'autres remarques"}]
[{"$f":"IF(Location!O52=0, \"Pas de questions ou d'autres remarques\",Location!O52)","v":"Pas de questions ou d'autres remarques"}]
[{"$f":"IF(Location!O53=0, \"Pas de questions ou d'autres remarques\",Location!O53)","v":"Pas de questions ou d'autres remarques"}]
[{"$f":"IF(Location!O54=0, \"Pas de questions ou d'autres remarques\",Location!O54)","v":"Pas de questions ou d'autres remarques"}]
[{"$f":"IF(Location!O55=0, \"Pas de questions ou d'autres remarques\",Location!O55)","v":"Pas de questions ou d'autres remarques"}]
[{"$f":"IF(Location!O56=0, \"Pas de questions ou d'autres remarques\",Location!O56)","v":"Pas de questions ou d'autres remarques"}]
[{"$f":"IF(Location!O57=0, \"Pas de questions ou d'autres remarques\",Location!O57)","v":"Pas de questions ou d'autres remarques"}]
[]
["INVESTISSMENTS:"]
[]
[{"$f":"IF(Investissements!Q6=0, \"Pas de questions ou d'autres remarques\",Investissements!Q6)","v":"Pas de questions ou d'autres remarques"}]
[{"$f":"IF(Investissements!Q7=0, \"Pas de questions ou d'autres remarques\",Investissements!Q7)","v":"Pas de questions ou d'autres remarques"}]
[{"$f":"IF(Investissements!Q8=0, \"Pas de questions ou d'autres remarques\",Investissements!Q8)","v":"Pas de questions ou d'autres remarques"}]
[{"$f":"IF(Investissements!Q9=0, \"Pas de questions ou d'autres remarques\",Investissements!Q9)","v":"Pas de questions ou d'autres remarques"}]
[{"$f":"IF(Investissements!Q10=0, \"Pas de questions ou d'autres remarques\",Investissements!Q10)","v":"Pas de questions ou d'autres remarques"}]
[]
["FRAIS DE FONCTIONNEMENT DIRECTS"]
[]
[{"$f":"'Frais de fonctionnement directs'!D6","v":"Choisissez dans la liste Frais de fonctionnement directs "}]
[]
[{"$f":"IF('Frais de fonctionnement directs'!O6=0, \"Pas de questions ou d'autres remarques\",'Frais de fonctionnement directs'!O6)","v":"Pas de questions ou d'autres remarques"}]
[{"$f":"IF('Frais de fonctionnement directs'!O7=0, \"Pas de questions ou d'autres remarques\",'Frais de fonctionnement directs'!O7)","v":"Pas de questions ou d'autres remarques"}]
[{"$f":"IF('Frais de fonctionnement directs'!O8=0, \"Pas de questions ou d'autres remarques\",'Frais de fonctionnement directs'!O8)","v":"Pas de questions ou d'autres remarques"}]
[{"$f":"IF('Frais de fonctionnement directs'!O9=0, \"Pas de questions ou d'autres remarques\",'Frais de fonctionnement directs'!O9)","v":"Pas de questions ou d'autres remarques"}]
[{"$f":"IF('Frais de fonctionnement directs'!O10=0, \"Pas de questions ou d'autres remarques\",'Frais de fonctionnement directs'!O10)","v":"Pas de questions ou d'autres remarques"}]
[{"$f":"IF('Frais de fonctionnement directs'!O11=0, \"Pas de questions ou d'autres remarques\",'Frais de fonctionnement directs'!O11)","v":"Pas de questions ou d'autres remarques"}]
[{"$f":"IF('Frais de fonctionnement directs'!O12=0, \"Pas de questions ou d'autres remarques\",'Frais de fonctionnement directs'!O12)","v":"Pas de questions ou d'autres remarques"}]
[{"$f":"IF('Frais de fonctionnement directs'!O13=0, \"Pas de questions ou d'autres remarques\",'Frais de fonctionnement directs'!O13)","v":"Pas de questions ou d'autres remarques"}]
[{"$f":"IF('Frais de fonctionnement directs'!O14=0, \"Pas de questions ou d'autres remarques\",'Frais de fonctionnement directs'!O14)","v":"Pas de questions ou d'autres remarques"}]
[{"$f":"IF('Frais de fonctionnement directs'!O15=0, \"Pas de questions ou d'autres remarques\",'Frais de fonctionnement directs'!O15)","v":"Pas de questions ou d'autres remarques"}]
[{"$f":"IF('Frais de fonctionnement directs'!O16=0, \"Pas de questions ou d'autres remarques\",'Frais de fonctionnement directs'!O16)","v":"Pas de questions ou d'autres remarques"}]
[{"$f":"IF('Frais de fonctionnement directs'!O17=0, \"Pas de questions ou d'autres remarques\",'Frais de fonctionnement directs'!O17)","v":"Pas de questions ou d'autres remarques"}]
[{"$f":"IF('Frais de fonctionnement directs'!O18=0, \"Pas de questions ou d'autres remarques\",'Frais de fonctionnement directs'!O18)","v":"Pas de questions ou d'autres remarques"}]
[]
[{"$f":"'Frais de fonctionnement directs'!D19","v":"Choisissez dans la liste Frais de fonctionnement directs "}]
[]
[{"$f":"IF('Frais de fonctionnement directs'!O19=0, \"Pas de questions ou d'autres remarques\",'Frais de fonctionnement directs'!O19)","v":"Pas de questions ou d'autres remarques"}]
[{"$f":"IF('Frais de fonctionnement directs'!O20=0, \"Pas de questions ou d'autres remarques\",'Frais de fonctionnement directs'!O20)","v":"Pas de questions ou d'autres remarques"}]
[{"$f":"IF('Frais de fonctionnement directs'!O21=0, \"Pas de questions ou d'autres remarques\",'Frais de fonctionnement directs'!O21)","v":"Pas de questions ou d'autres remarques"}]
[{"$f":"IF('Frais de fonctionnement directs'!O22=0, \"Pas de questions ou d'autres remarques\",'Frais de fonctionnement directs'!O22)","v":"Pas de questions ou d'autres remarques"}]
[{"$f":"IF('Frais de fonctionnement directs'!O23=0, \"Pas de questions ou d'autres remarques\",'Frais de fonctionnement directs'!O23)","v":"Pas de questions ou d'autres remarques"}]
[{"$f":"IF('Frais de fonctionnement directs'!O24=0, \"Pas de questions ou d'autres remarques\",'Frais de fonctionnement directs'!O24)","v":"Pas de questions ou d'autres remarques"}]
[{"$f":"IF('Frais de fonctionnement directs'!O25=0, \"Pas de questions ou d'autres remarques\",'Frais de fonctionnement directs'!O25)","v":"Pas de questions ou d'autres remarques"}]
[{"$f":"IF('Frais de fonctionnement directs'!O26=0, \"Pas de questions ou d'autres remarques\",'Frais de fonctionnement directs'!O26)","v":"Pas de questions ou d'autres remarques"}]
[{"$f":"IF('Frais de fonctionnement directs'!O27=0, \"Pas de questions ou d'autres remarques\",'Frais de fonctionnement directs'!O27)","v":"Pas de questions ou d'autres remarques"}]
[{"$f":"IF('Frais de fonctionnement directs'!O28=0, \"Pas de questions ou d'autres remarques\",'Frais de fonctionnement directs'!O28)","v":"Pas de questions ou d'autres remarques"}]
[{"$f":"IF('Frais de fonctionnement directs'!O29=0, \"Pas de questions ou d'autres remarques\",'Frais de fonctionnement directs'!O29)","v":"Pas de questions ou d'autres remarques"}]
[{"$f":"IF('Frais de fonctionnement directs'!O30=0, \"Pas de questions ou d'autres remarques\",'Frais de fonctionnement directs'!O30)","v":"Pas de questions ou d'autres remarques"}]
[{"$f":"IF('Frais de fonctionnement directs'!O31=0, \"Pas de questions ou d'autres remarques\",'Frais de fonctionnement directs'!O31)","v":"Pas de questions ou d'autres remarques"}]
[]
[{"$f":"'Frais de fonctionnement directs'!D32","v":"Choisissez dans la liste Frais de fonctionnement directs "}]
[]
[{"$f":"IF('Frais de fonctionnement directs'!O32=0, \"Pas de questions ou d'autres remarques\",'Frais de fonctionnement directs'!O32)","v":"Pas de questions ou d'autres remarques"}]
[{"$f":"IF('Frais de fonctionnement directs'!O33=0, \"Pas de questions ou d'autres remarques\",'Frais de fonctionnement directs'!O33)","v":"Pas de questions ou d'autres remarques"}]
[{"$f":"IF('Frais de fonctionnement directs'!O34=0, \"Pas de questions ou d'autres remarques\",'Frais de fonctionnement directs'!O34)","v":"Pas de questions ou d'autres remarques"}]
[{"$f":"IF('Frais de fonctionnement directs'!O35=0, \"Pas de questions ou d'autres remarques\",'Frais de fonctionnement directs'!O35)","v":"Pas de questions ou d'autres remarques"}]
[{"$f":"IF('Frais de fonctionnement directs'!O36=0, \"Pas de questions ou d'autres remarques\",'Frais de fonctionnement directs'!O36)","v":"Pas de questions ou d'autres remarques"}]
[{"$f":"IF('Frais de fonctionnement directs'!O37=0, \"Pas de questions ou d'autres remarques\",'Frais de fonctionnement directs'!O37)","v":"Pas de questions ou d'autres remarques"}]
[{"$f":"IF('Frais de fonctionnement directs'!O38=0, \"Pas de questions ou d'autres remarques\",'Frais de fonctionnement directs'!O38)","v":"Pas de questions ou d'autres remarques"}]
[{"$f":"IF('Frais de fonctionnement directs'!O39=0, \"Pas de questions ou d'autres remarques\",'Frais de fonctionnement directs'!O39)","v":"Pas de questions ou d'autres remarques"}]
[{"$f":"IF('Frais de fonctionnement directs'!O40=0, \"Pas de questions ou d'autres remarques\",'Frais de fonctionnement directs'!O40)","v":"Pas de questions ou d'autres remarques"}]
[{"$f":"IF('Frais de fonctionnement directs'!O41=0, \"Pas de questions ou d'autres remarques\",'Frais de fonctionnement directs'!O41)","v":"Pas de questions ou d'autres remarques"}]
[{"$f":"IF('Frais de fonctionnement directs'!O42=0, \"Pas de questions ou d'autres remarques\",'Frais de fonctionnement directs'!O42)","v":"Pas de questions ou d'autres remarques"}]
[{"$f":"IF('Frais de fonctionnement directs'!O43=0, \"Pas de questions ou d'autres remarques\",'Frais de fonctionnement directs'!O43)","v":"Pas de questions ou d'autres remarques"}]
[{"$f":"IF('Frais de fonctionnement directs'!O44=0, \"Pas de questions ou d'autres remarques\",'Frais de fonctionnement directs'!O44)","v":"Pas de questions ou d'autres remarques"}]
[]
[{"$f":"'Frais de fonctionnement directs'!D45","v":"Choisissez dans la liste Frais de fonctionnement directs "}]
[]
[{"$f":"IF('Frais de fonctionnement directs'!O45=0, \"Pas de questions ou d'autres remarques\",'Frais de fonctionnement directs'!O45)","v":"Pas de questions ou d'autres remarques"}]
[{"$f":"IF('Frais de fonctionnement directs'!O46=0, \"Pas de questions ou d'autres remarques\",'Frais de fonctionnement directs'!O46)","v":"Pas de questions ou d'autres remarques"}]
[{"$f":"IF('Frais de fonctionnement directs'!O47=0, \"Pas de questions ou d'autres remarques\",'Frais de fonctionnement directs'!O47)","v":"Pas de questions ou d'autres remarques"}]
[{"$f":"IF('Frais de fonctionnement directs'!O48=0, \"Pas de questions ou d'autres remarques\",'Frais de fonctionnement directs'!O48)","v":"Pas de questions ou d'autres remarques"}]
[{"$f":"IF('Frais de fonctionnement directs'!O49=0, \"Pas de questions ou d'autres remarques\",'Frais de fonctionnement directs'!O49)","v":"Pas de questions ou d'autres remarques"}]
[{"$f":"IF('Frais de fonctionnement directs'!O50=0, \"Pas de questions ou d'autres remarques\",'Frais de fonctionnement directs'!O50)","v":"Pas de questions ou d'autres remarques"}]
[{"$f":"IF('Frais de fonctionnement directs'!O51=0, \"Pas de questions ou d'autres remarques\",'Frais de fonctionnement directs'!O51)","v":"Pas de questions ou d'autres remarques"}]
[{"$f":"IF('Frais de fonctionnement directs'!O52=0, \"Pas de questions ou d'autres remarques\",'Frais de fonctionnement directs'!O52)","v":"Pas de questions ou d'autres remarques"}]
[{"$f":"IF('Frais de fonctionnement directs'!O53=0, \"Pas de questions ou d'autres remarques\",'Frais de fonctionnement directs'!O53)","v":"Pas de questions ou d'autres remarques"}]
[{"$f":"IF('Frais de fonctionnement directs'!O54=0, \"Pas de questions ou d'autres remarques\",'Frais de fonctionnement directs'!O54)","v":"Pas de questions ou d'autres remarques"}]
[{"$f":"IF('Frais de fonctionnement directs'!O55=0, \"Pas de questions ou d'autres remarques\",'Frais de fonctionnement directs'!O55)","v":"Pas de questions ou d'autres remarques"}]
[{"$f":"IF('Frais de fonctionnement directs'!O56=0, \"Pas de questions ou d'autres remarques\",'Frais de fonctionnement directs'!O56)","v":"Pas de questions ou d'autres remarques"}]
[{"$f":"IF('Frais de fonctionnement directs'!O57=0, \"Pas de questions ou d'autres remarques\",'Frais de fonctionnement directs'!O57)","v":"Pas de questions ou d'autres remarques"}]
[]
[{"$f":"'Frais de fonctionnement directs'!D58","v":"Choisissez dans la liste Frais de fonctionnement directs "}]
[]
[{"$f":"IF('Frais de fonctionnement directs'!O58=0, \"Pas de questions ou d'autres remarques\",'Frais de fonctionnement directs'!O58)","v":"Pas de questions ou d'autres remarques"}]
[{"$f":"IF('Frais de fonctionnement directs'!O59=0, \"Pas de questions ou d'autres remarques\",'Frais de fonctionnement directs'!O59)","v":"Pas de questions ou d'autres remarques"}]
[{"$f":"IF('Frais de fonctionnement directs'!O60=0, \"Pas de questions ou d'autres remarques\",'Frais de fonctionnement directs'!O60)","v":"Pas de questions ou d'autres remarques"}]
[{"$f":"IF('Frais de fonctionnement directs'!O61=0, \"Pas de questions ou d'autres remarques\",'Frais de fonctionnement directs'!O61)","v":"Pas de questions ou d'autres remarques"}]
[{"$f":"IF('Frais de fonctionnement directs'!O62=0, \"Pas de questions ou d'autres remarques\",'Frais de fonctionnement directs'!O62)","v":"Pas de questions ou d'autres remarques"}]
[{"$f":"IF('Frais de fonctionnement directs'!O63=0, \"Pas de questions ou d'autres remarques\",'Frais de fonctionnement directs'!O63)","v":"Pas de questions ou d'autres remarques"}]
[{"$f":"IF('Frais de fonctionnement directs'!O64=0, \"Pas de questions ou d'autres remarques\",'Frais de fonctionnement directs'!O64)","v":"Pas de questions ou d'autres remarques"}]
[{"$f":"IF('Frais de fonctionnement directs'!O65=0, \"Pas de questions ou d'autres remarques\",'Frais de fonctionnement directs'!O65)","v":"Pas de questions ou d'autres remarques"}]
[{"$f":"IF('Frais de fonctionnement directs'!O66=0, \"Pas de questions ou d'autres remarques\",'Frais de fonctionnement directs'!O66)","v":"Pas de questions ou d'autres remarques"}]
[{"$f":"IF('Frais de fonctionnement directs'!O67=0, \"Pas de questions ou d'autres remarques\",'Frais de fonctionnement directs'!O67)","v":"Pas de questions ou d'autres remarques"}]
[{"$f":"IF('Frais de fonctionnement directs'!O68=0, \"Pas de questions ou d'autres remarques\",'Frais de fonctionnement directs'!O68)","v":"Pas de questions ou d'autres remarques"}]
[{"$f":"IF('Frais de fonctionnement directs'!O69=0, \"Pas de questions ou d'autres remarques\",'Frais de fonctionnement directs'!O69)","v":"Pas de questions ou d'autres remarques"}]
[{"$f":"IF('Frais de fonctionnement directs'!O70=0, \"Pas de questions ou d'autres remarques\",'Frais de fonctionnement directs'!O70)","v":"Pas de questions ou d'autres remarques"}]
[]
[{"$f":"'Frais de fonctionnement directs'!D71","v":"Choisissez dans la liste Frais de fonctionnement directs "}]
[]
[{"$f":"IF('Frais de fonctionnement directs'!O71=0, \"Pas de questions ou d'autres remarques\",'Frais de fonctionnement directs'!O71)","v":"Pas de questions ou d'autres remarques"}]
[{"$f":"IF('Frais de fonctionnement directs'!O72=0, \"Pas de questions ou d'autres remarques\",'Frais de fonctionnement directs'!O72)","v":"Pas de questions ou d'autres remarques"}]
[{"$f":"IF('Frais de fonctionnement directs'!O73=0, \"Pas de questions ou d'autres remarques\",'Frais de fonctionnement directs'!O73)","v":"Pas de questions ou d'autres remarques"}]
[{"$f":"IF('Frais de fonctionnement directs'!O74=0, \"Pas de questions ou d'autres remarques\",'Frais de fonctionnement directs'!O74)","v":"Pas de questions ou d'autres remarques"}]
[{"$f":"IF('Frais de fonctionnement directs'!O75=0, \"Pas de questions ou d'autres remarques\",'Frais de fonctionnement directs'!O75)","v":"Pas de questions ou d'autres remarques"}]
[{"$f":"IF('Frais de fonctionnement directs'!O76=0, \"Pas de questions ou d'autres remarques\",'Frais de fonctionnement directs'!O76)","v":"Pas de questions ou d'autres remarques"}]
[{"$f":"IF('Frais de fonctionnement directs'!O77=0, \"Pas de questions ou d'autres remarques\",'Frais de fonctionnement directs'!O77)","v":"Pas de questions ou d'autres remarques"}]
[{"$f":"IF('Frais de fonctionnement directs'!O78=0, \"Pas de questions ou d'autres remarques\",'Frais de fonctionnement directs'!O78)","v":"Pas de questions ou d'autres remarques"}]
[{"$f":"IF('Frais de fonctionnement directs'!O79=0, \"Pas de questions ou d'autres remarques\",'Frais de fonctionnement directs'!O79)","v":"Pas de questions ou d'autres remarques"}]
[{"$f":"IF('Frais de fonctionnement directs'!O80=0, \"Pas de questions ou d'autres remarques\",'Frais de fonctionnement directs'!O80)","v":"Pas de questions ou d'autres remarques"}]
[{"$f":"IF('Frais de fonctionnement directs'!O81=0, \"Pas de questions ou d'autres remarques\",'Frais de fonctionnement directs'!O81)","v":"Pas de questions ou d'autres remarques"}]
[{"$f":"IF('Frais de fonctionnement directs'!O82=0, \"Pas de questions ou d'autres remarques\",'Frais de fonctionnement directs'!O82)","v":"Pas de questions ou d'autres remarques"}]
[{"$f":"IF('Frais de fonctionnement directs'!O83=0, \"Pas de questions ou d'autres remarques\",'Frais de fonctionnement directs'!O83)","v":"Pas de questions ou d'autres remarques"}]
[]
[{"$f":"'Frais de fonctionnement directs'!D84","v":"Choisissez dans la liste Frais de fonctionnement directs "}]
[]
[{"$f":"IF('Frais de fonctionnement directs'!O84=0, \"Pas de questions ou d'autres remarques\",'Frais de fonctionnement directs'!O84)","v":"Pas de questions ou d'autres remarques"}]
[{"$f":"IF('Frais de fonctionnement directs'!O85=0, \"Pas de questions ou d'autres remarques\",'Frais de fonctionnement directs'!O85)","v":"Pas de questions ou d'autres remarques"}]
[{"$f":"IF('Frais de fonctionnement directs'!O86=0, \"Pas de questions ou d'autres remarques\",'Frais de fonctionnement directs'!O86)","v":"Pas de questions ou d'autres remarques"}]
[{"$f":"IF('Frais de fonctionnement directs'!O87=0, \"Pas de questions ou d'autres remarques\",'Frais de fonctionnement directs'!O87)","v":"Pas de questions ou d'autres remarques"}]
[{"$f":"IF('Frais de fonctionnement directs'!O88=0, \"Pas de questions ou d'autres remarques\",'Frais de fonctionnement directs'!O88)","v":"Pas de questions ou d'autres remarques"}]
[{"$f":"IF('Frais de fonctionnement directs'!O89=0, \"Pas de questions ou d'autres remarques\",'Frais de fonctionnement directs'!O89)","v":"Pas de questions ou d'autres remarques"}]
[{"$f":"IF('Frais de fonctionnement directs'!O90=0, \"Pas de questions ou d'autres remarques\",'Frais de fonctionnement directs'!O90)","v":"Pas de questions ou d'autres remarques"}]
[{"$f":"IF('Frais de fonctionnement directs'!O91=0, \"Pas de questions ou d'autres remarques\",'Frais de fonctionnement directs'!O91)","v":"Pas de questions ou d'autres remarques"}]
[{"$f":"IF('Frais de fonctionnement directs'!O92=0, \"Pas de questions ou d'autres remarques\",'Frais de fonctionnement directs'!O92)","v":"Pas de questions ou d'autres remarques"}]
[{"$f":"IF('Frais de fonctionnement directs'!O93=0, \"Pas de questions ou d'autres remarques\",'Frais de fonctionnement directs'!O93)","v":"Pas de questions ou d'autres remarques"}]
[{"$f":"IF('Frais de fonctionnement directs'!O94=0, \"Pas de questions ou d'autres remarques\",'Frais de fonctionnement directs'!O94)","v":"Pas de questions ou d'autres remarques"}]
[{"$f":"IF('Frais de fonctionnement directs'!O95=0, \"Pas de questions ou d'autres remarques\",'Frais de fonctionnement directs'!O95)","v":"Pas de questions ou d'autres remarques"}]
[{"$f":"IF('Frais de fonctionnement directs'!O96=0, \"Pas de questions ou d'autres remarques\",'Frais de fonctionnement directs'!O96)","v":"Pas de questions ou d'autres remarques"}]
[]
[{"$f":"'Frais de fonctionnement directs'!D97","v":"Choisissez dans la liste Frais de fonctionnement directs "}]
[]
[{"$f":"IF('Frais de fonctionnement directs'!O97=0, \"Pas de questions ou d'autres remarques\",'Frais de fonctionnement directs'!O97)","v":"Pas de questions ou d'autres remarques"}]
[{"$f":"IF('Frais de fonctionnement directs'!O98=0, \"Pas de questions ou d'autres remarques\",'Frais de fonctionnement directs'!O98)","v":"Pas de questions ou d'autres remarques"}]
[{"$f":"IF('Frais de fonctionnement directs'!O99=0, \"Pas de questions ou d'autres remarques\",'Frais de fonctionnement directs'!O99)","v":"Pas de questions ou d'autres remarques"}]
[{"$f":"IF('Frais de fonctionnement directs'!O100=0, \"Pas de questions ou d'autres remarques\",'Frais de fonctionnement directs'!O100)","v":"Pas de questions ou d'autres remarques"}]
[{"$f":"IF('Frais de fonctionnement directs'!O101=0, \"Pas de questions ou d'autres remarques\",'Frais de fonctionnement directs'!O101)","v":"Pas de questions ou d'autres remarques"}]
[{"$f":"IF('Frais de fonctionnement directs'!O102=0, \"Pas de questions ou d'autres remarques\",'Frais de fonctionnement directs'!O102)","v":"Pas de questions ou d'autres remarques"}]
[{"$f":"IF('Frais de fonctionnement directs'!O103=0, \"Pas de questions ou d'autres remarques\",'Frais de fonctionnement directs'!O103)","v":"Pas de questions ou d'autres remarques"}]
[{"$f":"IF('Frais de fonctionnement directs'!O104=0, \"Pas de questions ou d'autres remarques\",'Frais de fonctionnement directs'!O104)","v":"Pas de questions ou d'autres remarques"}]
[{"$f":"IF('Frais de fonctionnement directs'!O105=0, \"Pas de questions ou d'autres remarques\",'Frais de fonctionnement directs'!O105)","v":"Pas de questions ou d'autres remarques"}]
[{"$f":"IF('Frais de fonctionnement directs'!O106=0, \"Pas de questions ou d'autres remarques\",'Frais de fonctionnement directs'!O106)","v":"Pas de questions ou d'autres remarques"}]
[{"$f":"IF('Frais de fonctionnement directs'!O107=0, \"Pas de questions ou d'autres remarques\",'Frais de fonctionnement directs'!O107)","v":"Pas de questions ou d'autres remarques"}]
[{"$f":"IF('Frais de fonctionnement directs'!O108=0, \"Pas de questions ou d'autres remarques\",'Frais de fonctionnement directs'!O108)","v":"Pas de questions ou d'autres remarques"}]
[{"$f":"IF('Frais de fonctionnement directs'!O109=0, \"Pas de questions ou d'autres remarques\",'Frais de fonctionnement directs'!O109)","v":"Pas de questions ou d'autres remarques"}]
[]
[{"$f":"'Frais de fonctionnement directs'!D110","v":"Choisissez dans la liste Frais de fonctionnement directs "}]
[]
[{"$f":"IF('Frais de fonctionnement directs'!O110=0, \"Pas de questions ou d'autres remarques\",'Frais de fonctionnement directs'!O110)","v":"Pas de questions ou d'autres remarques"}]
[{"$f":"IF('Frais de fonctionnement directs'!O111=0, \"Pas de questions ou d'autres remarques\",'Frais de fonctionnement directs'!O111)","v":"Pas de questions ou d'autres remarques"}]
[{"$f":"IF('Frais de fonctionnement directs'!O112=0, \"Pas de questions ou d'autres remarques\",'Frais de fonctionnement directs'!O112)","v":"Pas de questions ou d'autres remarques"}]
[{"$f":"IF('Frais de fonctionnement directs'!O113=0, \"Pas de questions ou d'autres remarques\",'Frais de fonctionnement directs'!O113)","v":"Pas de questions ou d'autres remarques"}]
[{"$f":"IF('Frais de fonctionnement directs'!O114=0, \"Pas de questions ou d'autres remarques\",'Frais de fonctionnement directs'!O114)","v":"Pas de questions ou d'autres remarques"}]
[{"$f":"IF('Frais de fonctionnement directs'!O115=0, \"Pas de questions ou d'autres remarques\",'Frais de fonctionnement directs'!O115)","v":"Pas de questions ou d'autres remarques"}]
[{"$f":"IF('Frais de fonctionnement directs'!O116=0, \"Pas de questions ou d'autres remarques\",'Frais de fonctionnement directs'!O116)","v":"Pas de questions ou d'autres remarques"}]
[{"$f":"IF('Frais de fonctionnement directs'!O117=0, \"Pas de questions ou d'autres remarques\",'Frais de fonctionnement directs'!O117)","v":"Pas de questions ou d'autres remarques"}]
[{"$f":"IF('Frais de fonctionnement directs'!O118=0, \"Pas de questions ou d'autres remarques\",'Frais de fonctionnement directs'!O118)","v":"Pas de questions ou d'autres remarques"}]
[{"$f":"IF('Frais de fonctionnement directs'!O119=0, \"Pas de questions ou d'autres remarques\",'Frais de fonctionnement directs'!O119)","v":"Pas de questions ou d'autres remarques"}]
[{"$f":"IF('Frais de fonctionnement directs'!O120=0, \"Pas de questions ou d'autres remarques\",'Frais de fonctionnement directs'!O120)","v":"Pas de questions ou d'autres remarques"}]
[{"$f":"IF('Frais de fonctionnement directs'!O121=0, \"Pas de questions ou d'autres remarques\",'Frais de fonctionnement directs'!O121)","v":"Pas de questions ou d'autres remarques"}]
[{"$f":"IF('Frais de fonctionnement directs'!O122=0, \"Pas de questions ou d'autres remarques\",'Frais de fonctionnement directs'!O122)","v":"Pas de questions ou d'autres remarques"}]
[]
[{"$f":"'Frais de fonctionnement directs'!D123","v":"Autre : (compléter soi-même) "}]
[]
[{"$f":"IF('Frais de fonctionnement directs'!O123=0, \"Pas de questions ou d'autres remarques\",'Frais de fonctionnement directs'!O123)","v":"Pas de questions ou d'autres remarques"}]
[{"$f":"IF('Frais de fonctionnement directs'!O124=0, \"Pas de questions ou d'autres remarques\",'Frais de fonctionnement directs'!O124)","v":"Pas de questions ou d'autres remarques"}]
[{"$f":"IF('Frais de fonctionnement directs'!O125=0, \"Pas de questions ou d'autres remarques\",'Frais de fonctionnement directs'!O125)","v":"Pas de questions ou d'autres remarques"}]
[{"$f":"IF('Frais de fonctionnement directs'!O126=0, \"Pas de questions ou d'autres remarques\",'Frais de fonctionnement directs'!O126)","v":"Pas de questions ou d'autres remarques"}]
[{"$f":"IF('Frais de fonctionnement directs'!O127=0, \"Pas de questions ou d'autres remarques\",'Frais de fonctionnement directs'!O127)","v":"Pas de questions ou d'autres remarques"}]
[{"$f":"IF('Frais de fonctionnement directs'!O128=0, \"Pas de questions ou d'autres remarques\",'Frais de fonctionnement directs'!O128)","v":"Pas de questions ou d'autres remarques"}]
[{"$f":"IF('Frais de fonctionnement directs'!O129=0, \"Pas de questions ou d'autres remarques\",'Frais de fonctionnement directs'!O129)","v":"Pas de questions ou d'autres remarques"}]
[{"$f":"IF('Frais de fonctionnement directs'!O130=0, \"Pas de questions ou d'autres remarques\",'Frais de fonctionnement directs'!O130)","v":"Pas de questions ou d'autres remarques"}]
[{"$f":"IF('Frais de fonctionnement directs'!O131=0, \"Pas de questions ou d'autres remarques\",'Frais de fonctionnement directs'!O131)","v":"Pas de questions ou d'autres remarques"}]
[{"$f":"IF('Frais de fonctionnement directs'!O132=0, \"Pas de questions ou d'autres remarques\",'Frais de fonctionnement directs'!O132)","v":"Pas de questions ou d'autres remarques"}]
[{"$f":"IF('Frais de fonctionnement directs'!O133=0, \"Pas de questions ou d'autres remarques\",'Frais de fonctionnement directs'!O133)","v":"Pas de questions ou d'autres remarques"}]
[{"$f":"IF('Frais de fonctionnement directs'!O134=0, \"Pas de questions ou d'autres remarques\",'Frais de fonctionnement directs'!O134)","v":"Pas de questions ou d'autres remarques"}]
[{"$f":"IF('Frais de fonctionnement directs'!O135=0, \"Pas de questions ou d'autres remarques\",'Frais de fonctionnement directs'!O135)","v":"Pas de questions ou d'autres remarques"}]
[]
[{"$f":"'Frais de fonctionnement directs'!D136","v":"Autre : (compléter soi-même) "}]
[]
[{"$f":"IF('Frais de fonctionnement directs'!O136=0, \"Pas de questions ou d'autres remarques\",'Frais de fonctionnement directs'!O136)","v":"Pas de questions ou d'autres remarques"}]
[{"$f":"IF('Frais de fonctionnement directs'!O137=0, \"Pas de questions ou d'autres remarques\",'Frais de fonctionnement directs'!O137)","v":"Pas de questions ou d'autres remarques"}]
[{"$f":"IF('Frais de fonctionnement directs'!O138=0, \"Pas de questions ou d'autres remarques\",'Frais de fonctionnement directs'!O138)","v":"Pas de questions ou d'autres remarques"}]
[{"$f":"IF('Frais de fonctionnement directs'!O139=0, \"Pas de questions ou d'autres remarques\",'Frais de fonctionnement directs'!O139)","v":"Pas de questions ou d'autres remarques"}]
[{"$f":"IF('Frais de fonctionnement directs'!O140=0, \"Pas de questions ou d'autres remarques\",'Frais de fonctionnement directs'!O140)","v":"Pas de questions ou d'autres remarques"}]
[{"$f":"IF('Frais de fonctionnement directs'!O141=0, \"Pas de questions ou d'autres remarques\",'Frais de fonctionnement directs'!O141)","v":"Pas de questions ou d'autres remarques"}]
[{"$f":"IF('Frais de fonctionnement directs'!O142=0, \"Pas de questions ou d'autres remarques\",'Frais de fonctionnement directs'!O142)","v":"Pas de questions ou d'autres remarques"}]
[{"$f":"IF('Frais de fonctionnement directs'!O143=0, \"Pas de questions ou d'autres remarques\",'Frais de fonctionnement directs'!O143)","v":"Pas de questions ou d'autres remarques"}]
[{"$f":"IF('Frais de fonctionnement directs'!O144=0, \"Pas de questions ou d'autres remarques\",'Frais de fonctionnement directs'!O144)","v":"Pas de questions ou d'autres remarques"}]
[{"$f":"IF('Frais de fonctionnement directs'!O145=0, \"Pas de questions ou d'autres remarques\",'Frais de fonctionnement directs'!O145)","v":"Pas de questions ou d'autres remarques"}]
[{"$f":"IF('Frais de fonctionnement directs'!O146=0, \"Pas de questions ou d'autres remarques\",'Frais de fonctionnement directs'!O146)","v":"Pas de questions ou d'autres remarques"}]
[{"$f":"IF('Frais de fonctionnement directs'!O147=0, \"Pas de questions ou d'autres remarques\",'Frais de fonctionnement directs'!O147)","v":"Pas de questions ou d'autres remarques"}]
[{"$f":"IF('Frais de fonctionnement directs'!O148=0, \"Pas de questions ou d'autres remarques\",'Frais de fonctionnement directs'!O148)","v":"Pas de questions ou d'autres remarques"}]
[{"$f":"IF('Frais de fonctionnement directs'!O149=0, \"Pas de questions ou d'autres remarques\",'Frais de fonctionnement directs'!O149)","v":"Pas de questions ou d'autres remarques"}]
[]
["AUTRE FRAIS DE FONCTIONNEMENT DIRECTS"]
[]
[{"$f":"'Frais de fctment indirects'!D6","v":"Choisissez dans la liste Frais de fonctionnement indirects"}]
[]
[{"$f":"IF('Frais de fctment indirects'!P6=0, \"Pas de questions ou d'autres remarques\",'Frais de fctment indirects'!P6)","v":"Pas de questions ou d'autres remarques"}]
[{"$f":"IF('Frais de fctment indirects'!P7=0, \"Pas de questions ou d'autres remarques\",'Frais de fctment indirects'!P7)","v":"Pas de questions ou d'autres remarques"}]
[{"$f":"IF('Frais de fctment indirects'!P8=0, \"Pas de questions ou d'autres remarques\",'Frais de fctment indirects'!P8)","v":"Pas de questions ou d'autres remarques"}]
[{"$f":"IF('Frais de fctment indirects'!P9=0, \"Pas de questions ou d'autres remarques\",'Frais de fctment indirects'!P9)","v":"Pas de questions ou d'autres remarques"}]
[{"$f":"IF('Frais de fctment indirects'!P10=0, \"Pas de questions ou d'autres remarques\",'Frais de fctment indirects'!P10)","v":"Pas de questions ou d'autres remarques"}]
[{"$f":"IF('Frais de fctment indirects'!P11=0, \"Pas de questions ou d'autres remarques\",'Frais de fctment indirects'!P11)","v":"Pas de questions ou d'autres remarques"}]
[{"$f":"IF('Frais de fctment indirects'!P12=0, \"Pas de questions ou d'autres remarques\",'Frais de fctment indirects'!P12)","v":"Pas de questions ou d'autres remarques"}]
[{"$f":"IF('Frais de fctment indirects'!P13=0, \"Pas de questions ou d'autres remarques\",'Frais de fctment indirects'!P13)","v":"Pas de questions ou d'autres remarques"}]
[{"$f":"IF('Frais de fctment indirects'!P14=0, \"Pas de questions ou d'autres remarques\",'Frais de fctment indirects'!P14)","v":"Pas de questions ou d'autres remarques"}]
[{"$f":"IF('Frais de fctment indirects'!P15=0, \"Pas de questions ou d'autres remarques\",'Frais de fctment indirects'!P15)","v":"Pas de questions ou d'autres remarques"}]
[{"$f":"IF('Frais de fctment indirects'!P16=0, \"Pas de questions ou d'autres remarques\",'Frais de fctment indirects'!P16)","v":"Pas de questions ou d'autres remarques"}]
[{"$f":"IF('Frais de fctment indirects'!P17=0, \"Pas de questions ou d'autres remarques\",'Frais de fctment indirects'!P17)","v":"Pas de questions ou d'autres remarques"}]
[{"$f":"IF('Frais de fctment indirects'!P18=0, \"Pas de questions ou d'autres remarques\",'Frais de fctment indirects'!P18)","v":"Pas de questions ou d'autres remarques"}]
[]
[{"$f":"'Frais de fctment indirects'!D19","v":"Choisissez dans la liste Frais de fonctionnement indirects"}]
[]
[{"$f":"IF('Frais de fctment indirects'!P19=0, \"Pas de questions ou d'autres remarques\",'Frais de fctment indirects'!P19)","v":"Pas de questions ou d'autres remarques"}]
[{"$f":"IF('Frais de fctment indirects'!P20=0, \"Pas de questions ou d'autres remarques\",'Frais de fctment indirects'!P20)","v":"Pas de questions ou d'autres remarques"}]
[{"$f":"IF('Frais de fctment indirects'!P21=0, \"Pas de questions ou d'autres remarques\",'Frais de fctment indirects'!P21)","v":"Pas de questions ou d'autres remarques"}]
[{"$f":"IF('Frais de fctment indirects'!P22=0, \"Pas de questions ou d'autres remarques\",'Frais de fctment indirects'!P22)","v":"Pas de questions ou d'autres remarques"}]
[{"$f":"IF('Frais de fctment indirects'!P23=0, \"Pas de questions ou d'autres remarques\",'Frais de fctment indirects'!P23)","v":"Pas de questions ou d'autres remarques"}]
[{"$f":"IF('Frais de fctment indirects'!P24=0, \"Pas de questions ou d'autres remarques\",'Frais de fctment indirects'!P24)","v":"Pas de questions ou d'autres remarques"}]
[{"$f":"IF('Frais de fctment indirects'!P25=0, \"Pas de questions ou d'autres remarques\",'Frais de fctment indirects'!P25)","v":"Pas de questions ou d'autres remarques"}]
[{"$f":"IF('Frais de fctment indirects'!P26=0, \"Pas de questions ou d'autres remarques\",'Frais de fctment indirects'!P26)","v":"Pas de questions ou d'autres remarques"}]
[{"$f":"IF('Frais de fctment indirects'!P27=0, \"Pas de questions ou d'autres remarques\",'Frais de fctment indirects'!P27)","v":"Pas de questions ou d'autres remarques"}]
[{"$f":"IF('Frais de fctment indirects'!P28=0, \"Pas de questions ou d'autres remarques\",'Frais de fctment indirects'!P28)","v":"Pas de questions ou d'autres remarques"}]
[{"$f":"IF('Frais de fctment indirects'!P29=0, \"Pas de questions ou d'autres remarques\",'Frais de fctment indirects'!P29)","v":"Pas de questions ou d'autres remarques"}]
[{"$f":"IF('Frais de fctment indirects'!P30=0, \"Pas de questions ou d'autres remarques\",'Frais de fctment indirects'!P30)","v":"Pas de questions ou d'autres remarques"}]
[{"$f":"IF('Frais de fctment indirects'!P31=0, \"Pas de questions ou d'autres remarques\",'Frais de fctment indirects'!P31)","v":"Pas de questions ou d'autres remarques"}]
[]
[{"$f":"'Frais de fctment indirects'!D32","v":"Choisissez dans la liste Frais de fonctionnement indirects"}]
[]
[{"$f":"IF('Frais de fctment indirects'!P32=0, \"Pas de questions ou d'autres remarques\",'Frais de fctment indirects'!P32)","v":"Pas de questions ou d'autres remarques"}]
[{"$f":"IF('Frais de fctment indirects'!P33=0, \"Pas de questions ou d'autres remarques\",'Frais de fctment indirects'!P33)","v":"Pas de questions ou d'autres remarques"}]
[{"$f":"IF('Frais de fctment indirects'!P34=0, \"Pas de questions ou d'autres remarques\",'Frais de fctment indirects'!P34)","v":"Pas de questions ou d'autres remarques"}]
[{"$f":"IF('Frais de fctment indirects'!P35=0, \"Pas de questions ou d'autres remarques\",'Frais de fctment indirects'!P35)","v":"Pas de questions ou d'autres remarques"}]
[{"$f":"IF('Frais de fctment indirects'!P36=0, \"Pas de questions ou d'autres remarques\",'Frais de fctment indirects'!P36)","v":"Pas de questions ou d'autres remarques"}]
[{"$f":"IF('Frais de fctment indirects'!P37=0, \"Pas de questions ou d'autres remarques\",'Frais de fctment indirects'!P37)","v":"Pas de questions ou d'autres remarques"}]
[{"$f":"IF('Frais de fctment indirects'!P38=0, \"Pas de questions ou d'autres remarques\",'Frais de fctment indirects'!P38)","v":"Pas de questions ou d'autres remarques"}]
[{"$f":"IF('Frais de fctment indirects'!P39=0, \"Pas de questions ou d'autres remarques\",'Frais de fctment indirects'!P39)","v":"Pas de questions ou d'autres remarques"}]
[{"$f":"IF('Frais de fctment indirects'!P40=0, \"Pas de questions ou d'autres remarques\",'Frais de fctment indirects'!P40)","v":"Pas de questions ou d'autres remarques"}]
[{"$f":"IF('Frais de fctment indirects'!P41=0, \"Pas de questions ou d'autres remarques\",'Frais de fctment indirects'!P41)","v":"Pas de questions ou d'autres remarques"}]
[{"$f":"IF('Frais de fctment indirects'!P42=0, \"Pas de questions ou d'autres remarques\",'Frais de fctment indirects'!P42)","v":"Pas de questions ou d'autres remarques"}]
[{"$f":"IF('Frais de fctment indirects'!P43=0, \"Pas de questions ou d'autres remarques\",'Frais de fctment indirects'!P43)","v":"Pas de questions ou d'autres remarques"}]
[{"$f":"IF('Frais de fctment indirects'!P44=0, \"Pas de questions ou d'autres remarques\",'Frais de fctment indirects'!P44)","v":"Pas de questions ou d'autres remarques"}]
[]
[{"$f":"'Frais de fctment indirects'!D45","v":"Choisissez dans la liste Frais de fonctionnement indirects"}]
[]
[{"$f":"IF('Frais de fctment indirects'!P45=0, \"Pas de questions ou d'autres remarques\",'Frais de fctment indirects'!P45)","v":"Pas de questions ou d'autres remarques"}]
[{"$f":"IF('Frais de fctment indirects'!P46=0, \"Pas de questions ou d'autres remarques\",'Frais de fctment indirects'!P46)","v":"Pas de questions ou d'autres remarques"}]
[{"$f":"IF('Frais de fctment indirects'!P47=0, \"Pas de questions ou d'autres remarques\",'Frais de fctment indirects'!P47)","v":"Pas de questions ou d'autres remarques"}]
[{"$f":"IF('Frais de fctment indirects'!P48=0, \"Pas de questions ou d'autres remarques\",'Frais de fctment indirects'!P48)","v":"Pas de questions ou d'autres remarques"}]
[{"$f":"IF('Frais de fctment indirects'!P49=0, \"Pas de questions ou d'autres remarques\",'Frais de fctment indirects'!P49)","v":"Pas de questions ou d'autres remarques"}]
[{"$f":"IF('Frais de fctment indirects'!P50=0, \"Pas de questions ou d'autres remarques\",'Frais de fctment indirects'!P50)","v":"Pas de questions ou d'autres remarques"}]
[{"$f":"IF('Frais de fctment indirects'!P51=0, \"Pas de questions ou d'autres remarques\",'Frais de fctment indirects'!P51)","v":"Pas de questions ou d'autres remarques"}]
[{"$f":"IF('Frais de fctment indirects'!P52=0, \"Pas de questions ou d'autres remarques\",'Frais de fctment indirects'!P52)","v":"Pas de questions ou d'autres remarques"}]
[{"$f":"IF('Frais de fctment indirects'!P53=0, \"Pas de questions ou d'autres remarques\",'Frais de fctment indirects'!P53)","v":"Pas de questions ou d'autres remarques"}]
[{"$f":"IF('Frais de fctment indirects'!P54=0, \"Pas de questions ou d'autres remarques\",'Frais de fctment indirects'!P54)","v":"Pas de questions ou d'autres remarques"}]
[{"$f":"IF('Frais de fctment indirects'!P55=0, \"Pas de questions ou d'autres remarques\",'Frais de fctment indirects'!P55)","v":"Pas de questions ou d'autres remarques"}]
[{"$f":"IF('Frais de fctment indirects'!P56=0, \"Pas de questions ou d'autres remarques\",'Frais de fctment indirects'!P56)","v":"Pas de questions ou d'autres remarques"}]
[{"$f":"IF('Frais de fctment indirects'!P57=0, \"Pas de questions ou d'autres remarques\",'Frais de fctment indirects'!P57)","v":"Pas de questions ou d'autres remarques"}]
[]
[{"$f":"'Frais de fctment indirects'!D58","v":"Choisissez dans la liste Frais de fonctionnement indirects"}]
[]
[{"$f":"IF('Frais de fctment indirects'!P58=0, \"Pas de questions ou d'autres remarques\",'Frais de fctment indirects'!P58)","v":"Pas de questions ou d'autres remarques"}]
[{"$f":"IF('Frais de fctment indirects'!P59=0, \"Pas de questions ou d'autres remarques\",'Frais de fctment indirects'!P59)","v":"Pas de questions ou d'autres remarques"}]
[{"$f":"IF('Frais de fctment indirects'!P60=0, \"Pas de questions ou d'autres remarques\",'Frais de fctment indirects'!P60)","v":"Pas de questions ou d'autres remarques"}]
[{"$f":"IF('Frais de fctment indirects'!P61=0, \"Pas de questions ou d'autres remarques\",'Frais de fctment indirects'!P61)","v":"Pas de questions ou d'autres remarques"}]
[{"$f":"IF('Frais de fctment indirects'!P62=0, \"Pas de questions ou d'autres remarques\",'Frais de fctment indirects'!P62)","v":"Pas de questions ou d'autres remarques"}]
[{"$f":"IF('Frais de fctment indirects'!P63=0, \"Pas de questions ou d'autres remarques\",'Frais de fctment indirects'!P63)","v":"Pas de questions ou d'autres remarques"}]
[{"$f":"IF('Frais de fctment indirects'!P64=0, \"Pas de questions ou d'autres remarques\",'Frais de fctment indirects'!P64)","v":"Pas de questions ou d'autres remarques"}]
[{"$f":"IF('Frais de fctment indirects'!P65=0, \"Pas de questions ou d'autres remarques\",'Frais de fctment indirects'!P65)","v":"Pas de questions ou d'autres remarques"}]
[{"$f":"IF('Frais de fctment indirects'!P66=0, \"Pas de questions ou d'autres remarques\",'Frais de fctment indirects'!P66)","v":"Pas de questions ou d'autres remarques"}]
[{"$f":"IF('Frais de fctment indirects'!P67=0, \"Pas de questions ou d'autres remarques\",'Frais de fctment indirects'!P67)","v":"Pas de questions ou d'autres remarques"}]
[{"$f":"IF('Frais de fctment indirects'!P68=0, \"Pas de questions ou d'autres remarques\",'Frais de fctment indirects'!P68)","v":"Pas de questions ou d'autres remarques"}]
[{"$f":"IF('Frais de fctment indirects'!P69=0, \"Pas de questions ou d'autres remarques\",'Frais de fctment indirects'!P69)","v":"Pas de questions ou d'autres remarques"}]
[{"$f":"IF('Frais de fctment indirects'!P70=0, \"Pas de questions ou d'autres remarques\",'Frais de fctment indirects'!P70)","v":"Pas de questions ou d'autres remarques"}]
[]
[{"$f":"'Frais de fctment indirects'!D71","v":"Choisissez dans la liste Frais de fonctionnement indirects"}]
[]
[{"$f":"IF('Frais de fctment indirects'!P71=0, \"Pas de questions ou d'autres remarques\",'Frais de fctment indirects'!P71)","v":"Pas de questions ou d'autres remarques"}]
[{"$f":"IF('Frais de fctment indirects'!P72=0, \"Pas de questions ou d'autres remarques\",'Frais de fctment indirects'!P72)","v":"Pas de questions ou d'autres remarques"}]
[{"$f":"IF('Frais de fctment indirects'!P73=0, \"Pas de questions ou d'autres remarques\",'Frais de fctment indirects'!P73)","v":"Pas de questions ou d'autres remarques"}]
[{"$f":"IF('Frais de fctment indirects'!P74=0, \"Pas de questions ou d'autres remarques\",'Frais de fctment indirects'!P74)","v":"Pas de questions ou d'autres remarques"}]
[{"$f":"IF('Frais de fctment indirects'!P75=0, \"Pas de questions ou d'autres remarques\",'Frais de fctment indirects'!P75)","v":"Pas de questions ou d'autres remarques"}]
[{"$f":"IF('Frais de fctment indirects'!P76=0, \"Pas de questions ou d'autres remarques\",'Frais de fctment indirects'!P76)","v":"Pas de questions ou d'autres remarques"}]
[{"$f":"IF('Frais de fctment indirects'!P77=0, \"Pas de questions ou d'autres remarques\",'Frais de fctment indirects'!P77)","v":"Pas de questions ou d'autres remarques"}]
[{"$f":"IF('Frais de fctment indirects'!P78=0, \"Pas de questions ou d'autres remarques\",'Frais de fctment indirects'!P78)","v":"Pas de questions ou d'autres remarques"}]
[{"$f":"IF('Frais de fctment indirects'!P79=0, \"Pas de questions ou d'autres remarques\",'Frais de fctment indirects'!P79)","v":"Pas de questions ou d'autres remarques"}]
[{"$f":"IF('Frais de fctment indirects'!P80=0, \"Pas de questions ou d'autres remarques\",'Frais de fctment indirects'!P80)","v":"Pas de questions ou d'autres remarques"}]
[{"$f":"IF('Frais de fctment indirects'!P81=0, \"Pas de questions ou d'autres remarques\",'Frais de fctment indirects'!P81)","v":"Pas de questions ou d'autres remarques"}]
[{"$f":"IF('Frais de fctment indirects'!P82=0, \"Pas de questions ou d'autres remarques\",'Frais de fctment indirects'!P82)","v":"Pas de questions ou d'autres remarques"}]
[{"$f":"IF('Frais de fctment indirects'!P83=0, \"Pas de questions ou d'autres remarques\",'Frais de fctment indirects'!P83)","v":"Pas de questions ou d'autres remarques"}]
[]
[{"$f":"'Frais de fctment indirects'!D84","v":"Choisissez dans la liste Frais de fonctionnement indirects"}]
[]
[{"$f":"IF('Frais de fctment indirects'!P84=0, \"Pas de questions ou d'autres remarques\",'Frais de fctment indirects'!P84)","v":"Pas de questions ou d'autres remarques"}]
[{"$f":"IF('Frais de fctment indirects'!P85=0, \"Pas de questions ou d'autres remarques\",'Frais de fctment indirects'!P85)","v":"Pas de questions ou d'autres remarques"}]
[{"$f":"IF('Frais de fctment indirects'!P86=0, \"Pas de questions ou d'autres remarques\",'Frais de fctment indirects'!P86)","v":"Pas de questions ou d'autres remarques"}]
[{"$f":"IF('Frais de fctment indirects'!P87=0, \"Pas de questions ou d'autres remarques\",'Frais de fctment indirects'!P87)","v":"Pas de questions ou d'autres remarques"}]
[{"$f":"IF('Frais de fctment indirects'!P88=0, \"Pas de questions ou d'autres remarques\",'Frais de fctment indirects'!P88)","v":"Pas de questions ou d'autres remarques"}]
[{"$f":"IF('Frais de fctment indirects'!P89=0, \"Pas de questions ou d'autres remarques\",'Frais de fctment indirects'!P89)","v":"Pas de questions ou d'autres remarques"}]
[{"$f":"IF('Frais de fctment indirects'!P90=0, \"Pas de questions ou d'autres remarques\",'Frais de fctment indirects'!P90)","v":"Pas de questions ou d'autres remarques"}]
[{"$f":"IF('Frais de fctment indirects'!P91=0, \"Pas de questions ou d'autres remarques\",'Frais de fctment indirects'!P91)","v":"Pas de questions ou d'autres remarques"}]
[{"$f":"IF('Frais de fctment indirects'!P92=0, \"Pas de questions ou d'autres remarques\",'Frais de fctment indirects'!P92)","v":"Pas de questions ou d'autres remarques"}]
[{"$f":"IF('Frais de fctment indirects'!P93=0, \"Pas de questions ou d'autres remarques\",'Frais de fctment indirects'!P93)","v":"Pas de questions ou d'autres remarques"}]
[{"$f":"IF('Frais de fctment indirects'!P94=0, \"Pas de questions ou d'autres remarques\",'Frais de fctment indirects'!P94)","v":"Pas de questions ou d'autres remarques"}]
[{"$f":"IF('Frais de fctment indirects'!P95=0, \"Pas de questions ou d'autres remarques\",'Frais de fctment indirects'!P95)","v":"Pas de questions ou d'autres remarques"}]
[{"$f":"IF('Frais de fctment indirects'!P96=0, \"Pas de questions ou d'autres remarques\",'Frais de fctment indirects'!P96)","v":"Pas de questions ou d'autres remarques"}]
[]
[{"$f":"'Frais de fctment indirects'!D97","v":"Choisissez dans la liste Frais de fonctionnement indirects"}]
[]
[{"$f":"IF('Frais de fctment indirects'!P97=0, \"Pas de questions ou d'autres remarques\",'Frais de fctment indirects'!P97)","v":"Pas de questions ou d'autres remarques"}]
[{"$f":"IF('Frais de fctment indirects'!P98=0, \"Pas de questions ou d'autres remarques\",'Frais de fctment indirects'!P98)","v":"Pas de questions ou d'autres remarques"}]
[{"$f":"IF('Frais de fctment indirects'!P99=0, \"Pas de questions ou d'autres remarques\",'Frais de fctment indirects'!P99)","v":"Pas de questions ou d'autres remarques"}]
[{"$f":"IF('Frais de fctment indirects'!P100=0, \"Pas de questions ou d'autres remarques\",'Frais de fctment indirects'!P100)","v":"Pas de questions ou d'autres remarques"}]
[{"$f":"IF('Frais de fctment indirects'!P101=0, \"Pas de questions ou d'autres remarques\",'Frais de fctment indirects'!P101)","v":"Pas de questions ou d'autres remarques"}]
[{"$f":"IF('Frais de fctment indirects'!P102=0, \"Pas de questions ou d'autres remarques\",'Frais de fctment indirects'!P102)","v":"Pas de questions ou d'autres remarques"}]
[{"$f":"IF('Frais de fctment indirects'!P103=0, \"Pas de questions ou d'autres remarques\",'Frais de fctment indirects'!P103)","v":"Pas de questions ou d'autres remarques"}]
[{"$f":"IF('Frais de fctment indirects'!P104=0, \"Pas de questions ou d'autres remarques\",'Frais de fctment indirects'!P104)","v":"Pas de questions ou d'autres remarques"}]
[{"$f":"IF('Frais de fctment indirects'!P105=0, \"Pas de questions ou d'autres remarques\",'Frais de fctment indirects'!P105)","v":"Pas de questions ou d'autres remarques"}]
[{"$f":"IF('Frais de fctment indirects'!P106=0, \"Pas de questions ou d'autres remarques\",'Frais de fctment indirects'!P106)","v":"Pas de questions ou d'autres remarques"}]
[{"$f":"IF('Frais de fctment indirects'!P107=0, \"Pas de questions ou d'autres remarques\",'Frais de fctment indirects'!P107)","v":"Pas de questions ou d'autres remarques"}]
[{"$f":"IF('Frais de fctment indirects'!P108=0, \"Pas de questions ou d'autres remarques\",'Frais de fctment indirects'!P108)","v":"Pas de questions ou d'autres remarques"}]
[{"$f":"IF('Frais de fctment indirects'!P109=0, \"Pas de questions ou d'autres remarques\",'Frais de fctment indirects'!P109)","v":"Pas de questions ou d'autres remarques"}]
[]
[{"$f":"'Frais de fctment indirects'!D110","v":"Choisissez dans la liste Frais de fonctionnement indirects"}]
[]
[{"$f":"IF('Frais de fctment indirects'!P110=0, \"Pas de questions ou d'autres remarques\",'Frais de fctment indirects'!P110)","v":"Pas de questions ou d'autres remarques"}]
[{"$f":"IF('Frais de fctment indirects'!P111=0, \"Pas de questions ou d'autres remarques\",'Frais de fctment indirects'!P111)","v":"Pas de questions ou d'autres remarques"}]
[{"$f":"IF('Frais de fctment indirects'!P112=0, \"Pas de questions ou d'autres remarques\",'Frais de fctment indirects'!P112)","v":"Pas de questions ou d'autres remarques"}]
[{"$f":"IF('Frais de fctment indirects'!P113=0, \"Pas de questions ou d'autres remarques\",'Frais de fctment indirects'!P113)","v":"Pas de questions ou d'autres remarques"}]
[{"$f":"IF('Frais de fctment indirects'!P114=0, \"Pas de questions ou d'autres remarques\",'Frais de fctment indirects'!P114)","v":"Pas de questions ou d'autres remarques"}]
[{"$f":"IF('Frais de fctment indirects'!P115=0, \"Pas de questions ou d'autres remarques\",'Frais de fctment indirects'!P115)","v":"Pas de questions ou d'autres remarques"}]
[{"$f":"IF('Frais de fctment indirects'!P116=0, \"Pas de questions ou d'autres remarques\",'Frais de fctment indirects'!P116)","v":"Pas de questions ou d'autres remarques"}]
[{"$f":"IF('Frais de fctment indirects'!P117=0, \"Pas de questions ou d'autres remarques\",'Frais de fctment indirects'!P117)","v":"Pas de questions ou d'autres remarques"}]
[{"$f":"IF('Frais de fctment indirects'!P118=0, \"Pas de questions ou d'autres remarques\",'Frais de fctment indirects'!P118)","v":"Pas de questions ou d'autres remarques"}]
[{"$f":"IF('Frais de fctment indirects'!P119=0, \"Pas de questions ou d'autres remarques\",'Frais de fctment indirects'!P119)","v":"Pas de questions ou d'autres remarques"}]
[{"$f":"IF('Frais de fctment indirects'!P120=0, \"Pas de questions ou d'autres remarques\",'Frais de fctment indirects'!P120)","v":"Pas de questions ou d'autres remarques"}]
[{"$f":"IF('Frais de fctment indirects'!P121=0, \"Pas de questions ou d'autres remarques\",'Frais de fctment indirects'!P121)","v":"Pas de questions ou d'autres remarques"}]
[{"$f":"IF('Frais de fctment indirects'!P122=0, \"Pas de questions ou d'autres remarques\",'Frais de fctment indirects'!P122)","v":"Pas de questions ou d'autres remarques"}]
[]
[{"$f":"'Frais de fctment indirects'!D123","v":"Choisissez dans la liste Frais de fonctionnement indirects"}]
[]
[{"$f":"IF('Frais de fctment indirects'!P123=0, \"Pas de questions ou d'autres remarques\",'Frais de fctment indirects'!P123)","v":"Pas de questions ou d'autres remarques"}]
[{"$f":"IF('Frais de fctment indirects'!P124=0, \"Pas de questions ou d'autres remarques\",'Frais de fctment indirects'!P124)","v":"Pas de questions ou d'autres remarques"}]
[{"$f":"IF('Frais de fctment indirects'!P125=0, \"Pas de questions ou d'autres remarques\",'Frais de fctment indirects'!P125)","v":"Pas de questions ou d'autres remarques"}]
[{"$f":"IF('Frais de fctment indirects'!P126=0, \"Pas de questions ou d'autres remarques\",'Frais de fctment indirects'!P126)","v":"Pas de questions ou d'autres remarques"}]
[{"$f":"IF('Frais de fctment indirects'!P127=0, \"Pas de questions ou d'autres remarques\",'Frais de fctment indirects'!P127)","v":"Pas de questions ou d'autres remarques"}]
[{"$f":"IF('Frais de fctment indirects'!P128=0, \"Pas de questions ou d'autres remarques\",'Frais de fctment indirects'!P128)","v":"Pas de questions ou d'autres remarques"}]
[{"$f":"IF('Frais de fctment indirects'!P129=0, \"Pas de questions ou d'autres remarques\",'Frais de fctment indirects'!P129)","v":"Pas de questions ou d'autres remarques"}]
[{"$f":"IF('Frais de fctment indirects'!P130=0, \"Pas de questions ou d'autres remarques\",'Frais de fctment indirects'!P130)","v":"Pas de questions ou d'autres remarques"}]
[{"$f":"IF('Frais de fctment indirects'!P131=0, \"Pas de questions ou d'autres remarques\",'Frais de fctment indirects'!P131)","v":"Pas de questions ou d'autres remarques"}]
[{"$f":"IF('Frais de fctment indirects'!P132=0, \"Pas de questions ou d'autres remarques\",'Frais de fctment indirects'!P132)","v":"Pas de questions ou d'autres remarques"}]
[{"$f":"IF('Frais de fctment indirects'!P133=0, \"Pas de questions ou d'autres remarques\",'Frais de fctment indirects'!P133)","v":"Pas de questions ou d'autres remarques"}]
[{"$f":"IF('Frais de fctment indirects'!P134=0, \"Pas de questions ou d'autres remarques\",'Frais de fctment indirects'!P134)","v":"Pas de questions ou d'autres remarques"}]
[{"$f":"IF('Frais de fctment indirects'!P135=0, \"Pas de questions ou d'autres remarques\",'Frais de fctment indirects'!P135)","v":"Pas de questions ou d'autres remarques"}]
[]
[{"$f":"'Frais de fctment indirects'!D136","v":"Autre : (compléter soi-même)"}]
[]
[{"$f":"IF('Frais de fctment indirects'!P136=0, \"Pas de questions ou d'autres remarques\",'Frais de fctment indirects'!P136)","v":"Pas de questions ou d'autres remarques"}]
[{"$f":"IF('Frais de fctment indirects'!P137=0, \"Pas de questions ou d'autres remarques\",'Frais de fctment indirects'!P137)","v":"Pas de questions ou d'autres remarques"}]
[{"$f":"IF('Frais de fctment indirects'!P138=0, \"Pas de questions ou d'autres remarques\",'Frais de fctment indirects'!P138)","v":"Pas de questions ou d'autres remarques"}]
[{"$f":"IF('Frais de fctment indirects'!P139=0, \"Pas de questions ou d'autres remarques\",'Frais de fctment indirects'!P139)","v":"Pas de questions ou d'autres remarques"}]
[{"$f":"IF('Frais de fctment indirects'!P140=0, \"Pas de questions ou d'autres remarques\",'Frais de fctment indirects'!P140)","v":"Pas de questions ou d'autres remarques"}]
[{"$f":"IF('Frais de fctment indirects'!P141=0, \"Pas de questions ou d'autres remarques\",'Frais de fctment indirects'!P141)","v":"Pas de questions ou d'autres remarques"}]
[{"$f":"IF('Frais de fctment indirects'!P142=0, \"Pas de questions ou d'autres remarques\",'Frais de fctment indirects'!P142)","v":"Pas de questions ou d'autres remarques"}]
[{"$f":"IF('Frais de fctment indirects'!P143=0, \"Pas de questions ou d'autres remarques\",'Frais de fctment indirects'!P143)","v":"Pas de questions ou d'autres remarques"}]
[{"$f":"IF('Frais de fctment indirects'!P144=0, \"Pas de questions ou d'autres remarques\",'Frais de fctment indirects'!P144)","v":"Pas de questions ou d'autres remarques"}]
[{"$f":"IF('Frais de fctment indirects'!P145=0, \"Pas de questions ou d'autres remarques\",'Frais de fctment indirects'!P145)","v":"Pas de questions ou d'autres remarques"}]
[{"$f":"IF('Frais de fctment indirects'!P146=0, \"Pas de questions ou d'autres remarques\",'Frais de fctment indirects'!P146)","v":"Pas de questions ou d'autres remarques"}]
[{"$f":"IF('Frais de fctment indirects'!P147=0, \"Pas de questions ou d'autres remarques\",'Frais de fctment indirects'!P147)","v":"Pas de questions ou d'autres remarques"}]
[{"$f":"IF('Frais de fctment indirects'!P148=0, \"Pas de questions ou d'autres remarques\",'Frais de fctment indirects'!P148)","v":"Pas de questions ou d'autres remarques"}]
[]
[{"$f":"'Frais de fctment indirects'!D149","v":"Autre : (compléter soi-même)"}]
[]
[{"$f":"IF('Frais de fctment indirects'!P149=0, \"Pas de questions ou d'autres remarques\",'Frais de fctment indirects'!P149)","v":"Pas de questions ou d'autres remarques"}]
[{"$f":"IF('Frais de fctment indirects'!P150=0, \"Pas de questions ou d'autres remarques\",'Frais de fctment indirects'!P150)","v":"Pas de questions ou d'autres remarques"}]
[{"$f":"IF('Frais de fctment indirects'!P151=0, \"Pas de questions ou d'autres remarques\",'Frais de fctment indirects'!P151)","v":"Pas de questions ou d'autres remarques"}]
[{"$f":"IF('Frais de fctment indirects'!P152=0, \"Pas de questions ou d'autres remarques\",'Frais de fctment indirects'!P152)","v":"Pas de questions ou d'autres remarques"}]
[{"$f":"IF('Frais de fctment indirects'!P153=0, \"Pas de questions ou d'autres remarques\",'Frais de fctment indirects'!P153)","v":"Pas de questions ou d'autres remarques"}]
[{"$f":"IF('Frais de fctment indirects'!P154=0, \"Pas de questions ou d'autres remarques\",'Frais de fctment indirects'!P154)","v":"Pas de questions ou d'autres remarques"}]
[{"$f":"IF('Frais de fctment indirects'!P155=0, \"Pas de questions ou d'autres remarques\",'Frais de fctment indirects'!P155)","v":"Pas de questions ou d'autres remarques"}]
[{"$f":"IF('Frais de fctment indirects'!P156=0, \"Pas de questions ou d'autres remarques\",'Frais de fctment indirects'!P156)","v":"Pas de questions ou d'autres remarques"}]
[{"$f":"IF('Frais de fctment indirects'!P157=0, \"Pas de questions ou d'autres remarques\",'Frais de fctment indirects'!P157)","v":"Pas de questions ou d'autres remarques"}]
[{"$f":"IF('Frais de fctment indirects'!P158=0, \"Pas de questions ou d'autres remarques\",'Frais de fctment indirects'!P158)","v":"Pas de questions ou d'autres remarques"}]
[{"$f":"IF('Frais de fctment indirects'!P159=0, \"Pas de questions ou d'autres remarques\",'Frais de fctment indirects'!P159)","v":"Pas de questions ou d'autres remarques"}]
[{"$f":"IF('Frais de fctment indirects'!P160=0, \"Pas de questions ou d'autres remarques\",'Frais de fctment indirects'!P160)","v":"Pas de questions ou d'autres remarques"}]
[{"$f":"IF('Frais de fctment indirects'!P161=0, \"Pas de questions ou d'autres remarques\",'Frais de fctment indirects'!P161)","v":"Pas de questions ou d'autres remarques"}]
[{"$f":"IF('Frais de fctment indirects'!P162=0, \"Pas de questions ou d'autres remarques\",'Frais de fctment indirects'!P162)","v":"Pas de questions ou d'autres remarques"}]
[]
[]
["Merci de bien vouloir nous donner une réponse, svp, avant le :",null,null,null,"dès que possible"]

{"sheet":"Reponses sur questions FIN","index":2,"n_rows":1086,"n_cols":3,"rows_kept":1086,"cut":false,"hidden":true,"merged":[[11,0,11,8],[12,0,12,8],[13,0,13,8],[14,0,14,8],[15,0,15,8],[16,0,16,8],[2,0,2,1],[2,2,2,8],[3,0,4,8],[8,0,8,8],[9,0,9,8],[10,0,10,8],[34,0,34,8],[35,0,35,8],[36,0,36,8],[37,0,37,8],[38,0,38,8],[39,0,39,8],[17,0,17,8],[18,0,18,8],[19,0,19,8],[20,0,20,8],[21,0,21,8],[33,0,33,8],[22,0,22,8],[23,0,23,8],[24,0,24,8],[25,0,25,8],[26,0,26,8],[27,0,27,8],[46,0,46,8],[47,0,47,8],[48,0,48,8],[49,0,49,8],[50,0,50,8],[51,0,51,8],[40,0,40,8],[41,0,41,8],[42,0,42,8],[43,0,43,8],[44,0,44,8],[45,0,45,8],[58,0,58,8],[59,0,59,8],[60,0,60,8],[61,0,61,8],[62,0,62,8],[63,0,63,8],[52,0,52,8],[53,0,53,8],[54,0,54,8],[55,0,55,8],[56,0,56,8],[57,0,57,8],[70,0,70,8],[71,0,71,8],[72,0,72,8],[73,0,73,8],[74,0,74,8],[75,0,75,8],[64,0,64,8],[65,0,65,8],[66,0,66,8],[67,0,67,8],[68,0,68,8],[69,0,69,8],[82,0,82,8],[83,0,83,8],[84,0,84,8],[85,0,85,8],[86,0,86,8],[87,0,87,8],[76,0,76,8],[77,0,77,8],[78,0,78,8],[79,0,79,8],[80,0,80,8],[81,0,81,8],[94,0,94,8],[95,0,95,8],[96,0,96,8],[97,0,97,8],[98,0,98,8],[99,0,99,8],[88,0,88,8],[89,0,89,8],[90,0,90,8],[91,0,91,8],[92,0,92,8],[93,0,93,8],[106,0,106,8],[107,0,107,8],[108,0,108,8],[109,0,109,8],[110,0,110,8],[111,0,111,8],[100,0,100,8],[101,0,101,8],[102,0,102,8],[103,0,103,8],[104,0,104,8],[105,0,105,8],[118,0,118,8],[119,0,119,8],[120,0,120,8],[121,0,121,8],[122,0,122,8],[123,0,123,8],[112,0,112,8],[113,0,113,8],[114,0,114,8],[115,0,115,8],[116,0,116,8],[117,0,117,8],[130,0,130,8],[131,0,131,8],[132,0,132,8],[133,0,133,8],[134,0,134,8],[135,0,135,8],[124,0,124,8],[125,0,125,8],[126,0,126,8],[127,0,127,8],[128,0,128,8],[129,0,129,8],[142,0,142,8],[143,0,143,8],[144,0,144,8],[145,0,145,8],[146,0,146,8],[147,0,147,8],[136,0,136,8],[137,0,137,8],[138,0,138,8],[139,0,139,8],[140,0,140,8],[141,0,141,8],[154,0,154,8],[155,0,155,8],[156,0,156,8],[157,0,157,8],[158,0,158,8],[159,0,159,8],[148,0,148,8],[149,0,149,8],[150,0,150,8],[151,0,151,8],[152,0,152,8],[153,0,153,8],[166,0,166,8],[167,0,167,8],[168,0,168,8],[169,0,169,8],[170,0,170,8],[171,0,171,8],[160,0,160,8],[161,0,161,8],[162,0,162,8],[163,0,163,8],[164,0,164,8],[165,0,165,8],[178,0,178,8],[179,0,179,8],[180,0,180,8],[181,0,181,8],[182,0,182,8],[183,0,183,8],[172,0,172,8],[173,0,173,8],[174,0,174,8],[175,0,175,8],[176,0,176,8],[177,0,177,8],[191,0,191,8],[192,0,192,8],[193,0,193,8],[194,0,194,8],[195,0,195,8],[196,0,196,8],[184,0,184,8],[185,0,185,8],[186,0,186,8],[188,0,188,8],[189,0,189,8],[190,0,190,8],[187,0,187,8],[204,0,204,8],[205,0,205,8],[206,0,206,8],[207,0,207,8],[208,0,208,8],[209,0,209,8],[197,0,197,8],[198,0,198,8],[200,0,200,8],[201,0,201,8],[202,0,202,8],[203,0,203,8],[199,0,199,8],[216,0,216,8],[217,0,217,8],[218,0,218,8],[219,0,219,8],[220,0,220,8],[221,0,221,8],[210,0,210,8],[211,0,211,8],[212,0,212,8],[213,0,213,8],[214,0,214,8],[215,0,215,8],[228,0,228,8],[229,0,229,8],[230,0,230,8],[231,0,231,8],[233,0,233,8],[234,0,234,8],[222,0,222,8],[223,0,223,8],[224,0,224,8],[225,0,225,8],[226,0,226,8],[227,0,227,8],[232,0,232,8],[240,0,240,8],[241,0,241,8],[242,0,242,8],[243,0,243,8],[244,0,244,8],[245,0,245,8],[235,0,235,8],[236,0,236,8],[237,0,237,8],[238,0,238,8],[239,0,239,8],[252,0,252,8],[253,0,253,8],[254,0,254,8],[255,0,255,8],[256,0,256,8],[257,0,257,8],[246,0,246,8],[247,0,247,8],[248,0,248,8],[249,0,249,8],[250,0,250,8],[251,0,251,8],[265,0,265,8],[266,0,266,8],[267,0,267,8],[268,0,268,8],[269,0,269,8],[258,0,258,8],[259,0,259,8],[260,0,260,8],[261,0,261,8],[262,0,262,8],[264,0,264,8],[263,0,263,8],[276,0,276,8],[277,0,277,8],[278,0,278,8],[279,0,279,8],[280,0,280,8],[281,0,281,8],[270,0,270,8],[271,0,271,8],[272,0,272,8],[273,0,273,8],[274,0,274,8],[275,0,275,8],[288,0,288,8],[289,0,289,8],[290,0,290,8],[294,0,294,8],[282,0,282,8],[283,0,283,8],[284,0,284,8],[285,0,285,8],[286,0,286,8],[287,0,287,8],[301,0,301,8],[302,0,302,8],[303,0,303,8],[304,0,304,8],[305,0,305,8],[306,0,306,8],[295,0,295,8],[296,0,296,8],[297,0,297,8],[298,0,298,8],[299,0,299,8],[300,0,300,8],[313,0,313,8],[314,0,314,8],[315,0,315,8],[316,0,316,8],[317,0,317,8],[318,0,318,8],[307,0,307,8],[308,0,308,8],[309,0,309,8],[310,0,310,8],[311,0,311,8],[312,0,312,8],[406,0,406,8],[407,0,407,8],[408,0,408,8],[409,0,409,8],[410,0,410,8],[416,0,416,8],[319,0,319,8],[401,0,401,8],[402,0,402,8],[403,0,403,8],[404,0,404,8],[405,0,405,8],[320,0,320,8],[321,0,321,8],[322,0,322,8],[323,0,323,8],[324,0,324,8],[325,0,325,8],[326,0,326,8],[327,0,327,8],[328,0,328,8],[329,0,329,8],[330,0,330,8],[331,0,331,8],[423,0,423,8],[424,0,424,8],[425,0,425,8],[426,0,426,8],[427,0,427,8],[428,0,428,8],[417,0,417,8],[418,0,418,8],[419,0,419,8],[420,0,420,8],[421,0,421,8],[422,0,422,8],[435,0,435,8],[436,0,436,8],[437,0,437,8],[438,0,438,8],[439,0,439,8],[440,0,440,8],[429,0,429,8],[430,0,430,8],[431,0,431,8],[432,0,432,8],[433,0,433,8],[434,0,434,8],[450,0,450,8],[451,0,451,8],[452,0,452,8],[453,0,453,8],[454,0,454,8],[455,0,455,8],[441,0,441,8],[445,0,445,8],[446,0,446,8],[447,0,447,8],[448,0,448,8],[449,0,449,8],[462,0,462,8],[463,0,463,8],[464,0,464,8],[465,0,465,8],[466,0,466,8],[467,0,467,8],[456,0,456,8],[457,0,457,8],[458,0,458,8],[459,0,459,8],[460,0,460,8],[461,0,461,8],[477,0,477,8],[478,0,478,8],[479,0,479,8],[480,0,480,8],[481,0,481,8],[482,0,482,8],[468,0,468,8],[469,0,469,8],[470,0,470,8],[474,0,474,8],[475,0,475,8],[476,0,476,8],[489,0,489,8],[490,0,490,8],[491,0,491,8],[492,0,492,8],[493,0,493,8],[494,0,494,8],[483,0,483,8],[484,0,484,8],[485,0,485,8],[486,0,486,8],[487,0,487,8],[488,0,488,8],[504,0,504,8],[505,0,505,8],[506,0,506,8],[507,0,507,8],[508,0,508,8],[509,0,509,8],[495,0,495,8],[496,0,496,8],[497,0,497,8],[498,0,498,8],[499,0,499,8],[503,0,503,8],[516,0,516,8],[517,0,517,8],[518,0,518,8],[519,0,519,8],[520,0,520,8],[521,0,521,8],[510,0,510,8],[511,0,511,8],[512,0,512,8],[513,0,513,8],[514,0,514,8],[515,0,515,8],[528,0,528,8],[532,0,532,8],[533,0,533,8],[534,0,534,8],[535,0,535,8],[536,0,536,8],[522,0,522,8],[523,0,523,8],[524,0,524,8],[525,0,525,8],[526,0,526,8],[527,0,527,8],[543,0,543,8],[544,0,544,8],[545,0,545,8],[546,0,546,8],[547,0,547,8],[548,0,548,8],[537,0,537,8],[538,0,538,8],[539,0,539,8],[540,0,540,8],[541,0,541,8],[542,0,542,8],[555,0,555,8],[556,0,556,8],[557,0,557,8],[561,0,561,8],[562,0,562,8],[563,0,563,8],[549,0,549,8],[550,0,550,8],[551,0,551,8],[552,0,552,8],[553,0,553,8],[554,0,554,8],[570,0,570,8],[571,0,571,8],[572,0,572,8],[573,0,573,8],[574,0,574,8],[575,0,575,8],[564,0,564,8],[565,0,565,8],[566,0,566,8],[567,0,567,8],[568,0,568,8],[569,0,569,8],[582,0,582,8],[583,0,583,8],[584,0,584,8],[585,0,585,8],[586,0,586,8],[590,0,590,8],[576,0,576,8],[577,0,577,8],[578,0,578,8],[579,0,579,8],[580,0,580,8],[581,0,581,8],[597,0,597,8],[598,0,598,8],[599,0,599,8],[600,0,600,8],[601,0,601,8],[602,0,602,8],[591,0,591,8],[592,0,592,8],[593,0,593,8],[594,0,594,8],[595,0,595,8],[596,0,596,8],[609,0,609,8],[610,0,610,8],[611,0,611,8],[612,0,612,8],[613,0,613,8],[614,0,614,8],[603,0,603,8],[604,0,604,8],[605,0,605,8],[606,0,606,8],[607,0,607,8],[608,0,608,8],[624,0,624,8],[625,0,625,8],[626,0,626,8],[627,0,627,8],[628,0,628,8],[629,0,629,8],[615,0,615,8],[619,0,619,8],[620,0,620,8],[621,0,621,8],[622,0,622,8],[623,0,623,8],[636,0,636,8],[637,0,637,8],[638,0,638,8],[639,0,639,8],[640,0,640,8],[641,0,641,8],[630,0,630,8],[631,0,631,8],[632,0,632,8],[633,0,633,8],[634,0,634,8],[635,0,635,8],[651,0,651,8],[652,0,652,8],[653,0,653,8],[654,0,654,8],[655,0,655,8],[656,0,656,8],[642,0,642,8],[643,0,643,8],[644,0,644,8],[648,0,648,8],[649,0,649,8],[650,0,650,8],[663,0,663,8],[664,0,664,8],[665,0,665,8],[666,0,666,8],[667,0,667,8],[668,0,668,8],[657,0,657,8],[658,0,658,8],[659,0,659,8],[660,0,660,8],[661,0,661,8],[662,0,662,8],[678,0,678,8],[679,0,679,8],[680,0,680,8],[681,0,681,8],[682,0,682,8],[683,0,683,8],[669,0,669,8],[670,0,670,8],[671,0,671,8],[672,0,672,8],[673,0,673,8],[677,0,677,8],[690,0,690,8],[691,0,691,8],[692,0,692,8],[693,0,693,8],[694,0,694,8],[695,0,695,8],[684,0,684,8],[685,0,685,8],[686,0,686,8],[687,0,687,8],[688,0,688,8],[689,0,689,8],[702,0,702,8],[706,0,706,8],[707,0,707,8],[708,0,708,8],[709,0,709,8],[710,0,710,8],[696,0,696,8],[697,0,697,8],[698,0,698,8],[699,0,699,8],[700,0,700,8],[701,0,701,8],[717,0,717,8],[718,0,718,8],[719,0,719,8],[720,0,720,8],[721,0,721,8],[722,0,722,8],[711,0,711,8],[712,0,712,8],[713,0,713,8],[714,0,714,8],[715,0,715,8],[716,0,716,8],[729,0,729,8],[730,0,730,8],[731,0,731,8],[732,0,732,8],[733,0,733,8],[739,0,739,8],[723,0,723,8],[724,0,724,8],[725,0,725,8],[726,0,726,8],[727,0,727,8],[728,0,728,8],[746,0,746,8],[747,0,747,8],[748,0,748,8],[749,0,749,8],[750,0,750,8],[751,0,751,8],[740,0,740,8],[741,0,741,8],[742,0,742,8],[743,0,743,8],[744,0,744,8],[745,0,745,8],[758,0,758,8],[759,0,759,8],[760,0,760,8],[761,0,761,8],[762,0,762,8],[763,0,763,8],[752,0,752,8],[753,0,753,8],[754,0,754,8],[755,0,755,8],[756,0,756,8],[757,0,757,8],[773,0,773,8],[774,0,774,8],[775,0,775,8],[776,0,776,8],[777,0,777,8],[778,0,778,8],[764,0,764,8],[768,0,768,8],[769,0,769,8],[770,0,770,8],[771,0,771,8],[772,0,772,8],[785,0,785,8],[786,0,786,8],[787,0,787,8],[788,0,788,8],[789,0,789,8],[790,0,790,8],[779,0,779,8],[780,0,780,8],[781,0,781,8],[782,0,782,8],[783,0,783,8],[784,0,784,8],[800,0,800,8],[801,0,801,8],[802,0,802,8],[803,0,803,8],[804,0,804,8],[805,0,805,8],[791,0,791,8],[792,0,792,8],[793,0,793,8],[797,0,797,8],[798,0,798,8],[799,0,799,8],[812,0,812,8],[813,0,813,8],[814,0,814,8],[815,0,815,8],[816,0,816,8],[817,0,817,8],[806,0,806,8],[807,0,807,8],[808,0,808,8],[809,0,809,8],[810,0,810,8],[811,0,811,8],[827,0,827,8],[828,0,828,8],[829,0,829,8],[830,0,830,8],[831,0,831,8],[832,0,832,8],[818,0,818,8],[819,0,819,8],[820,0,820,8],[821,0,821,8],[822,0,822,8],[826,0,826,8],[839,0,839,8],[840,0,840,8],[841,0,841,8],[842,0,842,8],[843,0,843,8],[844,0,844,8],[833,0,833,8],[834,0,834,8],[835,0,835,8],[836,0,836,8],[837,0,837,8],[838,0,838,8],[851,0,851,8],[855,0,855,8],[856,0,856,8],[857,0,857,8],[858,0,858,8],[859,0,859,8],[845,0,845,8],[846,0,846,8],[847,0,847,8],[848,0,848,8],[849,0,849,8],[850,0,850,8],[866,0,866,8],[867,0,867,8],[868,0,868,8],[869,0,869,8],[870,0,870,8],[871,0,871,8],[860,0,860,8],[861,0,861,8],[862,0,862,8],[863,0,863,8],[864,0,864,8],[865,0,865,8],[878,0,878,8],[879,0,879,8],[880,0,880,8],[884,0,884,8],[885,0,885,8],[886,0,886,8],[872,0,872,8],[873,0,873,8],[874,0,874,8],[875,0,875,8],[876,0,876,8],[877,0,877,8],[893,0,893,8],[894,0,894,8],[895,0,895,8],[896,0,896,8],[897,0,897,8],[898,0,898,8],[887,0,887,8],[888,0,888,8],[889,0,889,8],[890,0,890,8],[891,0,891,8],[892,0,892,8],[905,0,905,8],[906,0,906,8],[907,0,907,8],[908,0,908,8],[909,0,909,8],[913,0,913,8],[899,0,899,8],[900,0,900,8],[901,0,901,8],[902,0,902,8],[903,0,903,8],[904,0,904,8],[920,0,920,8],[921,0,921,8],[922,0,922,8],[923,0,923,8],[924,0,924,8],[925,0,925,8],[914,0,914,8],[915,0,915,8],[916,0,916,8],[917,0,917,8],[918,0,918,8],[919,0,919,8],[932,0,932,8],[933,0,933,8],[934,0,934,8],[935,0,935,8],[936,0,936,8],[937,0,937,8],[926,0,926,8],[927,0,927,8],[928,0,928,8],[929,0,929,8],[930,0,930,8],[931,0,931,8],[947,0,947,8],[948,0,948,8],[949,0,949,8],[950,0,950,8],[951,0,951,8],[952,0,952,8],[938,0,938,8],[942,0,942,8],[943,0,943,8],[944,0,944,8],[945,0,945,8],[946,0,946,8],[959,0,959,8],[960,0,960,8],[961,0,961,8],[962,0,962,8],[963,0,963,8],[964,0,964,8],[953,0,953,8],[954,0,954,8],[955,0,955,8],[956,0,956,8],[957,0,957,8],[958,0,958,8],[974,0,974,8],[975,0,975,8],[976,0,976,8],[977,0,977,8],[978,0,978,8],[979,0,979,8],[965,0,965,8],[966,0,966,8],[967,0,967,8],[971,0,971,8],[972,0,972,8],[973,0,973,8],[986,0,986,8],[987,0,987,8],[988,0,988,8],[989,0,989,8],[990,0,990,8],[991,0,991,8],[980,0,980,8],[981,0,981,8],[982,0,982,8],[983,0,983,8],[984,0,984,8],[985,0,985,8],[1001,0,1001,8],[1002,0,1002,8],[1003,0,1003,8],[1004,0,1004,8],[1005,0,1005,8],[1006,0,1006,8],[992,0,992,8],[993,0,993,8],[994,0,994,8],[995,0,995,8],[996,0,996,8],[1000,0,1000,8],[1013,0,1013,8],[1014,0,1014,8],[1015,0,1015,8],[1016,0,1016,8],[1017,0,1017,8],[1018,0,1018,8],[1007,0,1007,8],[1008,0,1008,8],[1009,0,1009,8],[1010,0,1010,8],[1011,0,1011,8],[1012,0,1012,8],[1025,0,1025,8],[1029,0,1029,8],[1030,0,1030,8],[1031,0,1031,8],[1032,0,1032,8],[1033,0,1033,8],[1019,0,1019,8],[1020,0,1020,8],[1021,0,1021,8],[1022,0,1022,8],[1023,0,1023,8],[1024,0,1024,8],[1040,0,1040,8],[1041,0,1041,8],[1042,0,1042,8],[1043,0,1043,8],[1044,0,1044,8],[1045,0,1045,8],[1034,0,1034,8],[1035,0,1035,8],[1036,0,1036,8],[1037,0,1037,8],[1038,0,1038,8],[1039,0,1039,8],[1052,0,1052,8],[1053,0,1053,8],[1054,0,1054,8],[1058,0,1058,8],[1059,0,1059,8],[1060,0,1060,8],[1046,0,1046,8],[1047,0,1047,8],[1048,0,1048,8],[1049,0,1049,8],[1050,0,1050,8],[1051,0,1051,8],[1067,0,1067,8],[1068,0,1068,8],[1069,0,1069,8],[1070,0,1070,8],[1071,0,1071,8],[1072,0,1072,8],[1061,0,1061,8],[1062,0,1062,8],[1063,0,1063,8],[1064,0,1064,8],[1065,0,1065,8],[1066,0,1066,8],[1085,0,1085,8],[1088,4,1088,8],[1079,0,1079,8],[1080,0,1080,8],[1081,0,1081,8],[1082,0,1082,8],[1083,0,1083,8],[1084,0,1084,8],[1073,0,1073,8],[1074,0,1074,8],[1075,0,1075,8],[1076,0,1076,8],[1077,0,1077,8],[1078,0,1078,8],[332,0,332,8],[333,0,333,8],[334,0,334,8],[335,0,335,8],[336,0,336,8],[337,0,337,8],[338,0,338,8],[339,0,339,8],[340,0,340,8],[341,0,341,8],[342,0,342,8],[343,0,343,8],[344,0,344,8],[345,0,345,8],[346,0,346,8],[347,0,347,8],[348,0,348,8],[349,0,349,8],[350,0,350,8],[351,0,351,8],[352,0,352,8],[353,0,353,8],[354,0,354,8],[355,0,355,8],[356,0,356,8],[357,0,357,8],[358,0,358,8],[359,0,359,8],[360,0,360,8],[361,0,361,8],[362,0,362,8],[363,0,363,8],[364,0,364,8],[365,0,365,8],[366,0,366,8],[367,0,367,8],[368,0,368,8],[369,0,369,8],[370,0,370,8],[371,0,371,8],[372,0,372,8],[373,0,373,8],[374,0,374,8],[375,0,375,8],[376,0,376,8],[377,0,377,8],[378,0,378,8],[379,0,379,8],[380,0,380,8],[381,0,381,8],[382,0,382,8],[383,0,383,8],[384,0,384,8],[385,0,385,8],[395,0,395,8],[396,0,396,8],[397,0,397,8],[386,0,386,8],[387,0,387,8],[388,0,388,8],[389,0,389,8],[390,0,390,8],[391,0,391,8],[392,0,392,8],[393,0,393,8],[394,0,394,8]]}
[]
[]
[{"$f":"'BUDGET AJU APPROUVE'!I3","v":"2021/XX"},null,{"$f":"'ETAPE 1'!D11","v":0}]
["Réponses aux questions supplémenaires cf rapport financier intermédiaire ou final "]
[]
[]
["QUESTIONS GENERALES"]
[]
[{"$f":"'Questions suppl Rapp FIN'!A9","v":"A.1. Merci de xx, svp. "}]
["Merci de répondre ici ou de mentionner le nom de l'annexe à laquelle vous souhaitez faire référence et d'agrandir la céllule en fonction de la langueur de votre réponse, svp."]
[{"$f":"'Questions suppl Rapp FIN'!A10","v":"A.2. Merci de xx, svp. "}]
["Merci de répondre ici ou de mentionner le nom de l'annexe à laquelle vous souhaitez faire référence et d'agrandir la céllule en fonction de la langueur de votre réponse, svp."]
[{"$f":"'Questions suppl Rapp FIN'!A11","v":"A.3. Merci de xx, svp. "}]
["Merci de répondre ici ou de mentionner le nom de l'annexe à laquelle vous souhaitez faire référence et d'agrandir la céllule en fonction de la langueur de votre réponse, svp."]
[{"$f":"'Questions suppl Rapp FIN'!A12","v":"A.4. Merci de xx, svp. "}]
["Merci de répondre ici ou de mentionner le nom de l'annexe à laquelle vous souhaitez faire référence et d'agrandir la céllule en fonction de la langueur de votre réponse, svp."]
[{"$f":"'Questions suppl Rapp FIN'!A13","v":"A.5. Merci de xx, svp. "}]
["Merci de répondre ici ou de mentionner le nom de l'annexe à laquelle vous souhaitez faire référence et d'agrandir la céllule en fonction de la langueur de votre réponse, svp."]
[{"$f":"'Questions suppl Rapp FIN'!A14","v":"A.6. Merci de xx, svp. "}]
["Merci de répondre ici ou de mentionner le nom de l'annexe à laquelle vous souhaitez faire référence et d'agrandir la céllule en fonction de la langueur de votre réponse, svp."]
[{"$f":"'Questions suppl Rapp FIN'!A15","v":"A.7. Merci de xx, svp. "}]
["Merci de répondre ici ou de mentionner le nom de l'annexe à laquelle vous souhaitez faire référence et d'agrandir la céllule en fonction de la langueur de votre réponse, svp."]
[{"$f":"'Questions suppl Rapp FIN'!A16","v":"A.8. Merci de xx, svp. "}]
["Merci de répondre ici ou de mentionner le nom de l'annexe à laquelle vous souhaitez faire référence et d'agrandir la céllule en fonction de la langueur de votre réponse, svp."]
[{"$f":"'Questions suppl Rapp FIN'!A17","v":"A.9. Merci de xx, svp. "}]
["Merci de répondre ici ou de mentionner le nom de l'annexe à laquelle vous souhaitez faire référence et d'agrandir la céllule en fonction de la langueur de votre réponse, svp."]
[{"$f":"'Questions suppl Rapp FIN'!A18","v":"A.10. Merci de xx, svp. "}]
["Merci de répondre ici ou de mentionner le nom de l'annexe à laquelle vous souhaitez faire référence et d'agrandir la céllule en fonction de la langueur de votre réponse, svp."]
[]
["QUESTIONS SPECIFIQUES PAR RUBRIQUE DE FRAIS"]
[]
["FRAIS DE PERSONNEL:"]
[]
[{"$f":"'Questions suppl Rapp FIN'!A24","v":"(nom à compléter)"}]
[{"$f":"'Questions suppl Rapp FIN'!A25","v":"Pas de questions ou d'autres remarques"}]
["Merci de répondre ici ou de mentionner le nom de l'annexe à laquelle vous souhaitez faire référence et d'agrandir la céllule en fonction de la langueur de votre réponse, svp."]
[{"$f":"'Questions suppl Rapp FIN'!A26","v":"Pas de questions ou d'autres remarques"}]
["Merci de répondre ici ou de mentionner le nom de l'annexe à laquelle vous souhaitez faire référence et d'agrandir la céllule en fonction de la langueur de votre réponse, svp."]
[{"$f":"'Questions suppl Rapp FIN'!A27","v":"Pas de questions ou d'autres remarques"}]
["Merci de répondre ici ou de mentionner le nom de l'annexe à laquelle vous souhaitez faire référence et d'agrandir la céllule en fonction de la langueur de votre réponse, svp."]
[{"$f":"'Questions suppl Rapp FIN'!A28","v":"Pas de questions ou d'autres remarques"}]
["Merci de répondre ici ou de mentionner le nom de l'annexe à laquelle vous souhaitez faire référence et d'agrandir la céllule en fonction de la langueur de votre réponse, svp."]
[{"$f":"'Questions suppl Rapp FIN'!A29","v":"Pas de questions ou d'autres remarques"}]
["Merci de répondre ici ou de mentionner le nom de l'annexe à laquelle vous souhaitez faire référence et d'agrandir la céllule en fonction de la langueur de votre réponse, svp."]
[{"$f":"'Questions suppl Rapp FIN'!A30","v":"Pas de questions ou d'autres remarques"}]
["Merci de répondre ici ou de mentionner le nom de l'annexe à laquelle vous souhaitez faire référence et d'agrandir la céllule en fonction de la langueur de votre réponse, svp."]
[{"$f":"'Questions suppl Rapp FIN'!A31","v":"Pas de questions ou d'autres remarques"}]
["Merci de répondre ici ou de mentionner le nom de l'annexe à laquelle vous souhaitez faire référence et d'agrandir la céllule en fonction de la langueur de votre réponse, svp."]
[{"$f":"'Questions suppl Rapp FIN'!A32","v":"Pas de questions ou d'autres remarques"}]
["Merci de répondre ici ou de mentionner le nom de l'annexe à laquelle vous souhaitez faire référence et d'agrandir la céllule en fonction de la langueur de votre réponse, svp."]
[{"$f":"'Questions suppl Rapp FIN'!A33","v":"Pas de questions ou d'autres remarques"}]
["Merci de répondre ici ou de mentionner le nom de l'annexe à laquelle vous souhaitez faire référence et d'agrandir la céllule en fonction de la langueur de votre réponse, svp."]
[{"$f":"'Questions suppl Rapp FIN'!A34","v":"Pas de questions ou d'autres remarques"}]
["Merci de répondre ici ou de mentionner le nom de l'annexe à laquelle vous souhaitez faire référence et d'agrandir la céllule en fonction de la langueur de votre réponse, svp."]
[{"$f":"'Questions suppl Rapp FIN'!A35","v":"Pas de questions ou d'autres remarques"}]
["Merci de répondre ici ou de mentionner le nom de l'annexe à laquelle vous souhaitez faire référence et d'agrandir la céllule en fonction de la langueur de votre réponse, svp."]
[{"$f":"'Questions suppl Rapp FIN'!A36","v":"Pas de questions ou d'autres remarques"}]
["Merci de répondre ici ou de mentionner le nom de l'annexe à laquelle vous souhaitez faire référence et d'agrandir la céllule en fonction de la langueur de votre réponse, svp."]
[{"$f":"'Questions suppl Rapp FIN'!A37","v":"Pas de questions ou d'autres remarques"}]
["Merci de répondre ici ou de mentionner le nom de l'annexe à laquelle vous souhaitez faire référence et d'agrandir la céllule en fonction de la langueur de votre réponse, svp."]
[{"$f":"'Questions suppl Rapp FIN'!A38","v":"Pas de questions ou d'autres remarques"}]
["Merci de répondre ici ou de mentionner le nom de l'annexe à laquelle vous souhaitez faire référence et d'agrandir la céllule en fonction de la langueur de votre réponse, svp."]
[{"$f":"'Questions suppl Rapp FIN'!A39","v":"Pas de questions ou d'autres remarques"}]
["Merci de répondre ici ou de mentionner le nom de l'annexe à laquelle vous souhaitez faire référence et d'agrandir la céllule en fonction de la langueur de votre réponse, svp."]
[{"$f":"'Questions suppl Rapp FIN'!A40","v":"Pas de questions ou d'autres remarques"}]
["Merci de répondre ici ou de mentionner le nom de l'annexe à laquelle vous souhaitez faire référence et d'agrandir la céllule en fonction de la langueur de votre réponse, svp."]
[{"$f":"'Questions suppl Rapp FIN'!A41","v":"(nom à compléter)"}]
[{"$f":"'Questions suppl Rapp FIN'!A42","v":"Pas de questions ou d'autres remarques"}]
["Merci de répondre ici ou de mentionner le nom de l'annexe à laquelle vous souhaitez faire référence et d'agrandir la céllule en fonction de la langueur de votre réponse, svp."]
[{"$f":"'Questions suppl Rapp FIN'!A43","v":"Pas de questions ou d'autres remarques"}]
["Merci de répondre ici ou de mentionner le nom de l'annexe à laquelle vous souhaitez faire référence et d'agrandir la céllule en fonction de la langueur de votre réponse, svp."]
[{"$f":"'Questions suppl Rapp FIN'!A44","v":"Pas de questions ou d'autres remarques"}]
["Merci de répondre ici ou de mentionner le nom de l'annexe à laquelle vous souhaitez faire référence et d'agrandir la céllule en fonction de la langueur de votre réponse, svp."]
[{"$f":"'Questions suppl Rapp FIN'!A45","v":"Pas de questions ou d'autres remarques"}]
["Merci de répondre ici ou de mentionner le nom de l'annexe à laquelle vous souhaitez faire référence et d'agrandir la céllule en fonction de la langueur de votre réponse, svp."]
[{"$f":"'Questions suppl Rapp FIN'!A46","v":"Pas de questions ou d'autres remarques"}]
["Merci de répondre ici ou de mentionner le nom de l'annexe à laquelle vous souhaitez faire référence et d'agrandir la céllule en fonction de la langueur de votre réponse, svp."]
[{"$f":"'Questions suppl Rapp FIN'!A47","v":"Pas de questions ou d'autres remarques"}]
["Merci de répondre ici ou de mentionner le nom de l'annexe à laquelle vous souhaitez faire référence et d'agrandir la céllule en fonction de la langueur de votre réponse, svp."]
[{"$f":"'Questions suppl Rapp FIN'!A48","v":"Pas de questions ou d'autres remarques"}]
["Merci de répondre ici ou de mentionner le nom de l'annexe à laquelle vous souhaitez faire référence et d'agrandir la céllule en fonction de la langueur de votre réponse, svp."]
[{"$f":"'Questions suppl Rapp FIN'!A49","v":"Pas de questions ou d'autres remarques"}]
["Merci de répondre ici ou de mentionner le nom de l'annexe à laquelle vous souhaitez faire référence et d'agrandir la céllule en fonction de la langueur de votre réponse, svp."]
[{"$f":"'Questions suppl Rapp FIN'!A50","v":"Pas de questions ou d'autres remarques"}]
["Merci de répondre ici ou de mentionner le nom de l'annexe à laquelle vous souhaitez faire référence et d'agrandir la céllule en fonction de la langueur de votre réponse, svp."]
[{"$f":"'Questions suppl Rapp FIN'!A51","v":"Pas de questions ou d'autres remarques"}]
["Merci de répondre ici ou de mentionner le nom de l'annexe à laquelle vous souhaitez faire référence et d'agrandir la céllule en fonction de la langueur de votre réponse, svp."]
[{"$f":"'Questions suppl Rapp FIN'!A52","v":"Pas de questions ou d'autres remarques"}]
["Merci de répondre ici ou de mentionner le nom de l'annexe à laquelle vous souhaitez faire référence et d'agrandir la céllule en fonction de la langueur de votre réponse, svp."]
[{"$f":"'Questions suppl Rapp FIN'!A53","v":"Pas de questions ou d'autres remarques"}]
["Merci de répondre ici ou de mentionner le nom de l'annexe à laquelle vous souhaitez faire référence et d'agrandir la céllule en fonction de la langueur de votre réponse, svp."]
[{"$f":"'Questions suppl Rapp FIN'!A54","v":"Pas de questions ou d'autres remarques"}]
["Merci de répondre ici ou de mentionner le nom de l'annexe à laquelle vous souhaitez faire référence et d'agrandir la céllule en fonction de la langueur de votre réponse, svp."]
[{"$f":"'Questions suppl Rapp FIN'!A55","v":"Pas de questions ou d'autres remarques"}]
["Merci de répondre ici ou de mentionner le nom de l'annexe à laquelle vous souhaitez faire référence et d'agrandir la céllule en fonction de la langueur de votre réponse, svp."]
[{"$f":"'Questions suppl Rapp FIN'!A56","v":"Pas de questions ou d'autres remarques"}]
["Merci de répondre ici ou de mentionner le nom de l'annexe à laquelle vous souhaitez faire référence et d'agrandir la céllule en fonction de la langueur de votre réponse, svp."]
[{"$f":"'Questions suppl Rapp FIN'!A57","v":"Pas de questions ou d'autres remarques"}]
["Merci de répondre ici ou de mentionner le nom de l'annexe à laquelle vous souhaitez faire référence et d'agrandir la céllule en fonction de la langueur de votre réponse, svp."]
[{"$f":"'Questions suppl Rapp FIN'!A58","v":"(nom à compléter)"}]
[{"$f":"'Questions suppl Rapp FIN'!A59","v":"Pas de questions ou d'autres remarques"}]
["Merci de répondre ici ou de mentionner le nom de l'annexe à laquelle vous souhaitez faire référence et d'agrandir la céllule en fonction de la langueur de votre réponse, svp."]
[{"$f":"'Questions suppl Rapp FIN'!A60","v":"Pas de questions ou d'autres remarques"}]
["Merci de répondre ici ou de mentionner le nom de l'annexe à laquelle vous souhaitez faire référence et d'agrandir la céllule en fonction de la langueur de votre réponse, svp."]
[{"$f":"'Questions suppl Rapp FIN'!A61","v":"Pas de questions ou d'autres remarques"}]
["Merci de répondre ici ou de mentionner le nom de l'annexe à laquelle vous souhaitez faire référence et d'agrandir la céllule en fonction de la langueur de votre réponse, svp."]
[{"$f":"'Questions suppl Rapp FIN'!A62","v":"Pas de questions ou d'autres remarques"}]
["Merci de répondre ici ou de mentionner le nom de l'annexe à laquelle vous souhaitez faire référence et d'agrandir la céllule en fonction de la langueur de votre réponse, svp."]
[{"$f":"'Questions suppl Rapp FIN'!A63","v":"Pas de questions ou d'autres remarques"}]
["Merci de répondre ici ou de mentionner le nom de l'annexe à laquelle vous souhaitez faire référence et d'agrandir la céllule en fonction de la langueur de votre réponse, svp."]
[{"$f":"'Questions suppl Rapp FIN'!A64","v":"Pas de questions ou d'autres remarques"}]
["Merci de répondre ici ou de mentionner le nom de l'annexe à laquelle vous souhaitez faire référence et d'agrandir la céllule en fonction de la langueur de votre réponse, svp."]
[{"$f":"'Questions suppl Rapp FIN'!A65","v":"Pas de questions ou d'autres remarques"}]
["Merci de répondre ici ou de mentionner le nom de l'annexe à laquelle vous souhaitez faire référence et d'agrandir la céllule en fonction de la langueur de votre réponse, svp."]
[{"$f":"'Questions suppl Rapp FIN'!A66","v":"Pas de questions ou d'autres remarques"}]
["Merci de répondre ici ou de mentionner le nom de l'annexe à laquelle vous souhaitez faire référence et d'agrandir la céllule en fonction de la langueur de votre réponse, svp."]
[{"$f":"'Questions suppl Rapp FIN'!A67","v":"Pas de questions ou d'autres remarques"}]
["Merci de répondre ici ou de mentionner le nom de l'annexe à laquelle vous souhaitez faire référence et d'agrandir la céllule en fonction de la langueur de votre réponse, svp."]
[{"$f":"'Questions suppl Rapp FIN'!A68","v":"Pas de questions ou d'autres remarques"}]
["Merci de répondre ici ou de mentionner le nom de l'annexe à laquelle vous souhaitez faire référence et d'agrandir la céllule en fonction de la langueur de votre réponse, svp."]
[{"$f":"'Questions suppl Rapp FIN'!A69","v":"Pas de questions ou d'autres remarques"}]
["Merci de répondre ici ou de mentionner le nom de l'annexe à laquelle vous souhaitez faire référence et d'agrandir la céllule en fonction de la langueur de votre réponse, svp."]
[{"$f":"'Questions suppl Rapp FIN'!A70","v":"Pas de questions ou d'autres remarques"}]
["Merci de répondre ici ou de mentionner le nom de l'annexe à laquelle vous souhaitez faire référence et d'agrandir la céllule en fonction de la langueur de votre réponse, svp."]
[{"$f":"'Questions suppl Rapp FIN'!A71","v":"Pas de questions ou d'autres remarques"}]
["Merci de répondre ici ou de mentionner le nom de l'annexe à laquelle vous souhaitez faire référence et d'agrandir la céllule en fonction de la langueur de votre réponse, svp."]
[{"$f":"'Questions suppl Rapp FIN'!A72","v":"Pas de questions ou d'autres remarques"}]
["Merci de répondre ici ou de mentionner le nom de l'annexe à laquelle vous souhaitez faire référence et d'agrandir la céllule en fonction de la langueur de votre réponse, svp."]
[{"$f":"'Questions suppl Rapp FIN'!A73","v":"Pas de questions ou d'autres remarques"}]
["Merci de répondre ici ou de mentionner le nom de l'annexe à laquelle vous souhaitez faire référence et d'agrandir la céllule en fonction de la langueur de votre réponse, svp."]
[{"$f":"'Questions suppl Rapp FIN'!A74","v":"Pas de questions ou d'autres remarques"}]
["Merci de répondre ici ou de mentionner le nom de l'annexe à laquelle vous souhaitez faire référence et d'agrandir la céllule en fonction de la langueur de votre réponse, svp."]
[{"$f":"'Questions suppl Rapp FIN'!A75","v":"(nom à compléter)"}]
[{"$f":"'Questions suppl Rapp FIN'!A76","v":"Pas de questions ou d'autres remarques"}]
["Merci de répondre ici ou de mentionner le nom de l'annexe à laquelle vous souhaitez faire référence et d'agrandir la céllule en fonction de la langueur de votre réponse, svp."]
[{"$f":"'Questions suppl Rapp FIN'!A77","v":"Pas de questions ou d'autres remarques"}]
["Merci de répondre ici ou de mentionner le nom de l'annexe à laquelle vous souhaitez faire référence et d'agrandir la céllule en fonction de la langueur de votre réponse, svp."]
[{"$f":"'Questions suppl Rapp FIN'!A78","v":"Pas de questions ou d'autres remarques"}]
["Merci de répondre ici ou de mentionner le nom de l'annexe à laquelle vous souhaitez faire référence et d'agrandir la céllule en fonction de la langueur de votre réponse, svp."]
[{"$f":"'Questions suppl Rapp FIN'!A79","v":"Pas de questions ou d'autres remarques"}]
["Merci de répondre ici ou de mentionner le nom de l'annexe à laquelle vous souhaitez faire référence et d'agrandir la céllule en fonction de la langueur de votre réponse, svp."]
[{"$f":"'Questions suppl Rapp FIN'!A80","v":"Pas de questions ou d'autres remarques"}]
["Merci de répondre ici ou de mentionner le nom de l'annexe à laquelle vous souhaitez faire référence et d'agrandir la céllule en fonction de la langueur de votre réponse, svp."]
[{"$f":"'Questions suppl Rapp FIN'!A81","v":"Pas de questions ou d'autres remarques"}]
["Merci de répondre ici ou de mentionner le nom de l'annexe à laquelle vous souhaitez faire référence et d'agrandir la céllule en fonction de la langueur de votre réponse, svp."]
[{"$f":"'Questions suppl Rapp FIN'!A82","v":"Pas de questions ou d'autres remarques"}]
["Merci de répondre ici ou de mentionner le nom de l'annexe à laquelle vous souhaitez faire référence et d'agrandir la céllule en fonction de la langueur de votre réponse, svp."]
[{"$f":"'Questions suppl Rapp FIN'!A83","v":"Pas de questions ou d'autres remarques"}]
["Merci de répondre ici ou de mentionner le nom de l'annexe à laquelle vous souhaitez faire référence et d'agrandir la céllule en fonction de la langueur de votre réponse, svp."]
[{"$f":"'Questions suppl Rapp FIN'!A84","v":"Pas de questions ou d'autres remarques"}]
["Merci de répondre ici ou de mentionner le nom de l'annexe à laquelle vous souhaitez faire référence et d'agrandir la céllule en fonction de la langueur de votre réponse, svp."]
[{"$f":"'Questions suppl Rapp FIN'!A85","v":"Pas de questions ou d'autres remarques"}]
["Merci de répondre ici ou de mentionner le nom de l'annexe à laquelle vous souhaitez faire référence et d'agrandir la céllule en fonction de la langueur de votre réponse, svp."]
[{"$f":"'Questions suppl Rapp FIN'!A86","v":"Pas de questions ou d'autres remarques"}]
["Merci de répondre ici ou de mentionner le nom de l'annexe à laquelle vous souhaitez faire référence et d'agrandir la céllule en fonction de la langueur de votre réponse, svp."]
[{"$f":"'Questions suppl Rapp FIN'!A87","v":"Pas de questions ou d'autres remarques"}]
["Merci de répondre ici ou de mentionner le nom de l'annexe à laquelle vous souhaitez faire référence et d'agrandir la céllule en fonction de la langueur de votre réponse, svp."]
[{"$f":"'Questions suppl Rapp FIN'!A88","v":"Pas de questions ou d'autres remarques"}]
["Merci de répondre ici ou de mentionner le nom de l'annexe à laquelle vous souhaitez faire référence et d'agrandir la céllule en fonction de la langueur de votre réponse, svp."]
[{"$f":"'Questions suppl Rapp FIN'!A89","v":"Pas de questions ou d'autres remarques"}]
["Merci de répondre ici ou de mentionner le nom de l'annexe à laquelle vous souhaitez faire référence et d'agrandir la céllule en fonction de la langueur de votre réponse, svp."]
[{"$f":"'Questions suppl Rapp FIN'!A90","v":"Pas de questions ou d'autres remarques"}]
["Merci de répondre ici ou de mentionner le nom de l'annexe à laquelle vous souhaitez faire référence et d'agrandir la céllule en fonction de la langueur de votre réponse, svp."]
[{"$f":"'Questions suppl Rapp FIN'!A91","v":"Pas de questions ou d'autres remarques"}]
["Merci de répondre ici ou de mentionner le nom de l'annexe à laquelle vous souhaitez faire référence et d'agrandir la céllule en fonction de la langueur de votre réponse, svp."]
[{"$f":"'Questions suppl Rapp FIN'!A92","v":"(nom à compléter)"}]
[{"$f":"'Questions suppl Rapp FIN'!A93","v":"Pas de questions ou d'autres remarques"}]
["Merci de répondre ici ou de mentionner le nom de l'annexe à laquelle vous souhaitez faire référence et d'agrandir la céllule en fonction de la langueur de votre réponse, svp."]
[{"$f":"'Questions suppl Rapp FIN'!A94","v":"Pas de questions ou d'autres remarques"}]
["Merci de répondre ici ou de mentionner le nom de l'annexe à laquelle vous souhaitez faire référence et d'agrandir la céllule en fonction de la langueur de votre réponse, svp."]
[{"$f":"'Questions suppl Rapp FIN'!A95","v":"Pas de questions ou d'autres remarques"}]
["Merci de répondre ici ou de mentionner le nom de l'annexe à laquelle vous souhaitez faire référence et d'agrandir la céllule en fonction de la langueur de votre réponse, svp."]
[{"$f":"'Questions suppl Rapp FIN'!A96","v":"Pas de questions ou d'autres remarques"}]
["Merci de répondre ici ou de mentionner le nom de l'annexe à laquelle vous souhaitez faire référence et d'agrandir la céllule en fonction de la langueur de votre réponse, svp."]
[{"$f":"'Questions suppl Rapp FIN'!A97","v":"Pas de questions ou d'autres remarques"}]
["Merci de répondre ici ou de mentionner le nom de l'annexe à laquelle vous souhaitez faire référence et d'agrandir la céllule en fonction de la langueur de votre réponse, svp."]
[{"$f":"'Questions suppl Rapp FIN'!A98","v":"Pas de questions ou d'autres remarques"}]
["Merci de répondre ici ou de mentionner le nom de l'annexe à laquelle vous souhaitez faire référence et d'agrandir la céllule en fonction de la langueur de votre réponse, svp."]
[{"$f":"'Questions suppl Rapp FIN'!A99","v":"Pas de questions ou d'autres remarques"}]
["Merci de répondre ici ou de mentionner le nom de l'annexe à laquelle vous souhaitez faire référence et d'agrandir la céllule en fonction de la langueur de votre réponse, svp."]
[{"$f":"'Questions suppl Rapp FIN'!A100","v":"Pas de questions ou d'autres remarques"}]
["Merci de répondre ici ou de mentionner le nom de l'annexe à laquelle vous souhaitez faire référence et d'agrandir la céllule en fonction de la langueur de votre réponse, svp."]
[{"$f":"'Questions suppl Rapp FIN'!A101","v":"Pas de questions ou d'autres remarques"}]
["Merci de répondre ici ou de mentionner le nom de l'annexe à laquelle vous souhaitez faire référence et d'agrandir la céllule en fonction de la langueur de votre réponse, svp."]
[{"$f":"'Questions suppl Rapp FIN'!A102","v":"Pas de questions ou d'autres remarques"}]
["Merci de répondre ici ou de mentionner le nom de l'annexe à laquelle vous souhaitez faire référence et d'agrandir la céllule en fonction de la langueur de votre réponse, svp."]
[{"$f":"'Questions suppl Rapp FIN'!A103","v":"Pas de questions ou d'autres remarques"}]
["Merci de répondre ici ou de mentionner le nom de l'annexe à laquelle vous souhaitez faire référence et d'agrandir la céllule en fonction de la langueur de votre réponse, svp."]
[{"$f":"'Questions suppl Rapp FIN'!A104","v":"Pas de questions ou d'autres remarques"}]
["Merci de répondre ici ou de mentionner le nom de l'annexe à laquelle vous souhaitez faire référence et d'agrandir la céllule en fonction de la langueur de votre réponse, svp."]
[{"$f":"'Questions suppl Rapp FIN'!A105","v":"Pas de questions ou d'autres remarques"}]
["Merci de répondre ici ou de mentionner le nom de l'annexe à laquelle vous souhaitez faire référence et d'agrandir la céllule en fonction de la langueur de votre réponse, svp."]
[{"$f":"'Questions suppl Rapp FIN'!A106","v":"Pas de questions ou d'autres remarques"}]
["Merci de répondre ici ou de mentionner le nom de l'annexe à laquelle vous souhaitez faire référence et d'agrandir la céllule en fonction de la langueur de votre réponse, svp."]
[{"$f":"'Questions suppl Rapp FIN'!A107","v":"Pas de questions ou d'autres remarques"}]
["Merci de répondre ici ou de mentionner le nom de l'annexe à laquelle vous souhaitez faire référence et d'agrandir la céllule en fonction de la langueur de votre réponse, svp."]
[{"$f":"'Questions suppl Rapp FIN'!A108","v":"Pas de questions ou d'autres remarques"}]
["Merci de répondre ici ou de mentionner le nom de l'annexe à laquelle vous souhaitez faire référence et d'agrandir la céllule en fonction de la langueur de votre réponse, svp."]
[{"$f":"'Questions suppl Rapp FIN'!A109","v":"(nom à compléter)"}]
[{"$f":"'Questions suppl Rapp FIN'!A110","v":"Pas de questions ou d'autres remarques"}]
["Merci de répondre ici ou de mentionner le nom de l'annexe à laquelle vous souhaitez faire référence et d'agrandir la céllule en fonction de la langueur de votre réponse, svp."]
[{"$f":"'Questions suppl Rapp FIN'!A111","v":"Pas de questions ou d'autres remarques"}]
["Merci de répondre ici ou de mentionner le nom de l'annexe à laquelle vous souhaitez faire référence et d'agrandir la céllule en fonction de la langueur de votre réponse, svp."]
[{"$f":"'Questions suppl Rapp FIN'!A112","v":"Pas de questions ou d'autres remarques"}]
["Merci de répondre ici ou de mentionner le nom de l'annexe à laquelle vous souhaitez faire référence et d'agrandir la céllule en fonction de la langueur de votre réponse, svp."]
[{"$f":"'Questions suppl Rapp FIN'!A113","v":"Pas de questions ou d'autres remarques"}]
["Merci de répondre ici ou de mentionner le nom de l'annexe à laquelle vous souhaitez faire référence et d'agrandir la céllule en fonction de la langueur de votre réponse, svp."]
[{"$f":"'Questions suppl Rapp FIN'!A114","v":"Pas de questions ou d'autres remarques"}]
["Merci de répondre ici ou de mentionner le nom de l'annexe à laquelle vous souhaitez faire référence et d'agrandir la céllule en fonction de la langueur de votre réponse, svp."]
[{"$f":"'Questions suppl Rapp FIN'!A115","v":"Pas de questions ou d'autres remarques"}]
["Merci de répondre ici ou de mentionner le nom de l'annexe à laquelle vous souhaitez faire référence et d'agrandir la céllule en fonction de la langueur de votre réponse, svp."]
[{"$f":"'Questions suppl Rapp FIN'!A116","v":"Pas de questions ou d'autres remarques"}]
["Merci de répondre ici ou de mentionner le nom de l'annexe à laquelle vous souhaitez faire référence et d'agrandir la céllule en fonction de la langueur de votre réponse, svp."]
[{"$f":"'Questions suppl Rapp FIN'!A117","v":"Pas de questions ou d'autres remarques"}]
["Merci de répondre ici ou de mentionner le nom de l'annexe à laquelle vous souhaitez faire référence et d'agrandir la céllule en fonction de la langueur de votre réponse, svp."]
[{"$f":"'Questions suppl Rapp FIN'!A118","v":"Pas de questions ou d'autres remarques"}]
["Merci de répondre ici ou de mentionner le nom de l'annexe à laquelle vous souhaitez faire référence et d'agrandir la céllule en fonction de la langueur de votre réponse, svp."]
[{"$f":"'Questions suppl Rapp FIN'!A119","v":"Pas de questions ou d'autres remarques"}]
["Merci de répondre ici ou de mentionner le nom de l'annexe à laquelle vous souhaitez faire référence et d'agrandir la céllule en fonction de la langueur de votre réponse, svp."]
[{"$f":"'Questions suppl Rapp FIN'!A120","v":"Pas de questions ou d'autres remarques"}]
["Merci de répondre ici ou de mentionner le nom de l'annexe à laquelle vous souhaitez faire référence et d'agrandir la céllule en fonction de la langueur de votre réponse, svp."]
[{"$f":"'Questions suppl Rapp FIN'!A121","v":"Pas de questions ou d'autres remarques"}]
["Merci de répondre ici ou de mentionner le nom de l'annexe à laquelle vous souhaitez faire référence et d'agrandir la céllule en fonction de la langueur de votre réponse, svp."]
[{"$f":"'Questions suppl Rapp FIN'!A122","v":"Pas de questions ou d'autres remarques"}]
["Merci de répondre ici ou de mentionner le nom de l'annexe à laquelle vous souhaitez faire référence et d'agrandir la céllule en fonction de la langueur de votre réponse, svp."]
[{"$f":"'Questions suppl Rapp FIN'!A123","v":"Pas de questions ou d'autres remarques"}]
["Merci de répondre ici ou de mentionner le nom de l'annexe à laquelle vous souhaitez faire référence et d'agrandir la céllule en fonction de la langueur de votre réponse, svp."]
[{"$f":"'Questions suppl Rapp FIN'!A124","v":"Pas de questions ou d'autres remarques"}]
["Merci de répondre ici ou de mentionner le nom de l'annexe à laquelle vous souhaitez faire référence et d'agrandir la céllule en fonction de la langueur de votre réponse, svp."]
[{"$f":"'Questions suppl Rapp FIN'!A125","v":"Pas de questions ou d'autres remarques"}]
["Merci de répondre ici ou de mentionner le nom de l'annexe à laquelle vous souhaitez faire référence et d'agrandir la céllule en fonction de la langueur de votre réponse, svp."]
[{"$f":"'Questions suppl Rapp FIN'!A126","v":"(nom à compléter)"}]
[{"$f":"'Questions suppl Rapp FIN'!A127","v":"Pas de questions ou d'autres remarques"}]
["Merci de répondre ici ou de mentionner le nom de l'annexe à laquelle vous souhaitez faire référence et d'agrandir la céllule en fonction de la langueur de votre réponse, svp."]
[{"$f":"'Questions suppl Rapp FIN'!A128","v":"Pas de questions ou d'autres remarques"}]
["Merci de répondre ici ou de mentionner le nom de l'annexe à laquelle vous souhaitez faire référence et d'agrandir la céllule en fonction de la langueur de votre réponse, svp."]
[{"$f":"'Questions suppl Rapp FIN'!A129","v":"Pas de questions ou d'autres remarques"}]
["Merci de répondre ici ou de mentionner le nom de l'annexe à laquelle vous souhaitez faire référence et d'agrandir la céllule en fonction de la langueur de votre réponse, svp."]
[{"$f":"'Questions suppl Rapp FIN'!A130","v":"Pas de questions ou d'autres remarques"}]
["Merci de répondre ici ou de mentionner le nom de l'annexe à laquelle vous souhaitez faire référence et d'agrandir la céllule en fonction de la langueur de votre réponse, svp."]
[{"$f":"'Questions suppl Rapp FIN'!A131","v":"Pas de questions ou d'autres remarques"}]
["Merci de répondre ici ou de mentionner le nom de l'annexe à laquelle vous souhaitez faire référence et d'agrandir la céllule en fonction de la langueur de votre réponse, svp."]
[{"$f":"'Questions suppl Rapp FIN'!A132","v":"Pas de questions ou d'autres remarques"}]
["Merci de répondre ici ou de mentionner le nom de l'annexe à laquelle vous souhaitez faire référence et d'agrandir la céllule en fonction de la langueur de votre réponse, svp."]
[{"$f":"'Questions suppl Rapp FIN'!A133","v":"Pas de questions ou d'autres remarques"}]
["Merci de répondre ici ou de mentionner le nom de l'annexe à laquelle vous souhaitez faire référence et d'agrandir la céllule en fonction de la langueur de votre réponse, svp."]
[{"$f":"'Questions suppl Rapp FIN'!A134","v":"Pas de questions ou d'autres remarques"}]
["Merci de répondre ici ou de mentionner le nom de l'annexe à laquelle vous souhaitez faire référence et d'agrandir la céllule en fonction de la langueur de votre réponse, svp."]
[{"$f":"'Questions suppl Rapp FIN'!A135","v":"Pas de questions ou d'autres remarques"}]
["Merci de répondre ici ou de mentionner le nom de l'annexe à laquelle vous souhaitez faire référence et d'agrandir la céllule en fonction de la langueur de votre réponse, svp."]
[{"$f":"'Questions suppl Rapp FIN'!A136","v":"Pas de questions ou d'autres remarques"}]
["Merci de répondre ici ou de mentionner le nom de l'annexe à laquelle vous souhaitez faire référence et d'agrandir la céllule en fonction de la langueur de votre réponse, svp."]
[{"$f":"'Questions suppl Rapp FIN'!A137","v":"Pas de questions ou d'autres remarques"}]
["Merci de répondre ici ou de mentionner le nom de l'annexe à laquelle vous souhaitez faire référence et d'agrandir la céllule en fonction de la langueur de votre réponse, svp."]
[{"$f":"'Questions suppl Rapp FIN'!A138","v":"Pas de questions ou d'autres remarques"}]
["Merci de répondre ici ou de mentionner le nom de l'annexe à laquelle vous souhaitez faire référence et d'agrandir la céllule en fonction de la langueur de votre réponse, svp."]
[{"$f":"'Questions suppl Rapp FIN'!A139","v":"Pas de questions ou d'autres remarques"}]
["Merci de répondre ici ou de mentionner le nom de l'annexe à laquelle vous souhaitez faire référence et d'agrandir la céllule en fonction de la langueur de votre réponse, svp."]
[{"$f":"'Questions suppl Rapp FIN'!A140","v":"Pas de questions ou d'autres remarques"}]
["Merci de répondre ici ou de mentionner le nom de l'annexe à laquelle vous souhaitez faire référence et d'agrandir la céllule en fonction de la langueur de votre réponse, svp."]
[{"$f":"'Questions suppl Rapp FIN'!A141","v":"Pas de questions ou d'autres remarques"}]
["Merci de répondre ici ou de mentionner le nom de l'annexe à laquelle vous souhaitez faire référence et d'agrandir la céllule en fonction de la langueur de votre réponse, svp."]
[{"$f":"'Questions suppl Rapp FIN'!A142","v":"(nom à compléter)"}]
[{"$f":"'Questions suppl Rapp FIN'!A143","v":"Pas de questions ou d'autres remarques"}]
["Merci de répondre ici ou de mentionner le nom de l'annexe à laquelle vous souhaitez faire référence et d'agrandir la céllule en fonction de la langueur de votre réponse, svp."]
[{"$f":"'Questions suppl Rapp FIN'!A144","v":"Pas de questions ou d'autres remarques"}]
["Merci de répondre ici ou de mentionner le nom de l'annexe à laquelle vous souhaitez faire référence et d'agrandir la céllule en fonction de la langueur de votre réponse, svp."]
[{"$f":"'Questions suppl Rapp FIN'!A145","v":"Pas de questions ou d'autres remarques"}]
["Merci de répondre ici ou de mentionner le nom de l'annexe à laquelle vous souhaitez faire référence et d'agrandir la céllule en fonction de la langueur de votre réponse, svp."]
[{"$f":"'Questions suppl Rapp FIN'!A146","v":"Pas de questions ou d'autres remarques"}]
["Merci de répondre ici ou de mentionner le nom de l'annexe à laquelle vous souhaitez faire référence et d'agrandir la céllule en fonction de la langueur de votre réponse, svp."]
[{"$f":"'Questions suppl Rapp FIN'!A147","v":"Pas de questions ou d'autres remarques"}]
["Merci de répondre ici ou de mentionner le nom de l'annexe à laquelle vous souhaitez faire référence et d'agrandir la céllule en fonction de la langueur de votre réponse, svp."]
[{"$f":"'Questions suppl Rapp FIN'!A148","v":"Pas de questions ou d'autres remarques"}]
["Merci de répondre ici ou de mentionner le nom de l'annexe à laquelle vous souhaitez faire référence et d'agrandir la céllule en fonction de la langueur de votre réponse, svp."]
[{"$f":"'Questions suppl Rapp FIN'!A149","v":"Pas de questions ou d'autres remarques"}]
["Merci de répondre ici ou de mentionner le nom de l'annexe à laquelle vous souhaitez faire référence et d'agrandir la céllule en fonction de la langueur de votre réponse, svp."]
[{"$f":"'Questions suppl Rapp FIN'!A150","v":"Pas de questions ou d'autres remarques"}]
["Merci de répondre ici ou de mentionner le nom de l'annexe à laquelle vous souhaitez faire référence et d'agrandir la céllule en fonction de la langueur de votre réponse, svp."]
[{"$f":"'Questions suppl Rapp FIN'!A151","v":"Pas de questions ou d'autres remarques"}]
["Merci de répondre ici ou de mentionner le nom de l'annexe à laquelle vous souhaitez faire référence et d'agrandir la céllule en fonction de la langueur de votre réponse, svp."]
[{"$f":"'Questions suppl Rapp FIN'!A152","v":"Pas de questions ou d'autres remarques"}]
["Merci de répondre ici ou de mentionner le nom de l'annexe à laquelle vous souhaitez faire référence et d'agrandir la céllule en fonction de la langueur de votre réponse, svp."]
[{"$f":"'Questions suppl Rapp FIN'!A153","v":"Pas de questions ou d'autres remarques"}]
["Merci de répondre ici ou de mentionner le nom de l'annexe à laquelle vous souhaitez faire référence et d'agrandir la céllule en fonction de la langueur de votre réponse, svp."]
[{"$f":"'Questions suppl Rapp FIN'!A154","v":"Pas de questions ou d'autres remarques"}]
["Merci de répondre ici ou de mentionner le nom de l'annexe à laquelle vous souhaitez faire référence et d'agrandir la céllule en fonction de la langueur de votre réponse, svp."]
[{"$f":"'Questions suppl Rapp FIN'!A155","v":"Pas de questions ou d'autres remarques"}]
["Merci de répondre ici ou de mentionner le nom de l'annexe à laquelle vous souhaitez faire référence et d'agrandir la céllule en fonction de la langueur de votre réponse, svp."]
[{"$f":"'Questions suppl Rapp FIN'!A156","v":"Pas de questions ou d'autres remarques"}]
["Merci de répondre ici ou de mentionner le nom de l'annexe à laquelle vous souhaitez faire référence et d'agrandir la céllule en fonction de la langueur de votre réponse, svp."]
[]
["LOCATION:"]
[]
[{"$f":"'Questions suppl Rapp FIN'!A160","v":"Pas de questions ou d'autres remarques"}]
["Merci de répondre ici ou de mentionner le nom de l'annexe à laquelle vous souhaitez faire référence et d'agrandir la céllule en fonction de la langueur de votre réponse, svp."]
[{"$f":"'Questions suppl Rapp FIN'!A161","v":"Pas de questions ou d'autres remarques"}]
["Merci de répondre ici ou de mentionner le nom de l'annexe à laquelle vous souhaitez faire référence et d'agrandir la céllule en fonction de la langueur de votre réponse, svp."]
[{"$f":"'Questions suppl Rapp FIN'!A162","v":"Pas de questions ou d'autres remarques"}]
["Merci de répondre ici ou de mentionner le nom de l'annexe à laquelle vous souhaitez faire référence et d'agrandir la céllule en fonction de la langueur de votre réponse, svp."]
[{"$f":"'Questions suppl Rapp FIN'!A163","v":"Pas de questions ou d'autres remarques"}]
["Merci de répondre ici ou de mentionner le nom de l'annexe à laquelle vous souhaitez faire référence et d'agrandir la céllule en fonction de la langueur de votre réponse, svp."]
[{"$f":"'Questions suppl Rapp FIN'!A164","v":"Pas de questions ou d'autres remarques"}]
["Merci de répondre ici ou de mentionner le nom de l'annexe à laquelle vous souhaitez faire référence et d'agrandir la céllule en fonction de la langueur de votre réponse, svp."]
[{"$f":"'Questions suppl Rapp FIN'!A165","v":"Pas de questions ou d'autres remarques"}]
["Merci de répondre ici ou de mentionner le nom de l'annexe à laquelle vous souhaitez faire référence et d'agrandir la céllule en fonction de la langueur de votre réponse, svp."]
[{"$f":"'Questions suppl Rapp FIN'!A166","v":"Pas de questions ou d'autres remarques"}]
["Merci de répondre ici ou de mentionner le nom de l'annexe à laquelle vous souhaitez faire référence et d'agrandir la céllule en fonction de la langueur de votre réponse, svp."]
[{"$f":"'Questions suppl Rapp FIN'!A167","v":"Pas de questions ou d'autres remarques"}]
["Merci de répondre ici ou de mentionner le nom de l'annexe à laquelle vous souhaitez faire référence et d'agrandir la céllule en fonction de la langueur de votre réponse, svp."]
[{"$f":"'Questions suppl Rapp FIN'!A168","v":"Pas de questions ou d'autres remarques"}]
["Merci de répondre ici ou de mentionner le nom de l'annexe à laquelle vous souhaitez faire référence et d'agrandir la céllule en fonction de la langueur de votre réponse, svp."]
[{"$f":"'Questions suppl Rapp FIN'!A169","v":"Pas de questions ou d'autres remarques"}]
["Merci de répondre ici ou de mentionner le nom de l'annexe à laquelle vous souhaitez faire référence et d'agrandir la céllule en fonction de la langueur de votre réponse, svp."]
[{"$f":"'Questions suppl Rapp FIN'!A170","v":"Pas de questions ou d'autres remarques"}]
["Merci de répondre ici ou de mentionner le nom de l'annexe à laquelle vous souhaitez faire référence et d'agrandir la céllule en fonction de la langueur de votre réponse, svp."]
[{"$f":"'Questions suppl Rapp FIN'!A171","v":"Pas de questions ou d'autres remarques"}]
["Merci de répondre ici ou de mentionner le nom de l'annexe à laquelle vous souhaitez faire référence et d'agrandir la céllule en fonction de la langueur de votre réponse, svp."]
[{"$f":"'Questions suppl Rapp FIN'!A172","v":"Pas de questions ou d'autres remarques"}]
["Merci de répondre ici ou de mentionner le nom de l'annexe à laquelle vous souhaitez faire référence et d'agrandir la céllule en fonction de la langueur de votre réponse, svp."]
[{"$f":"'Questions suppl Rapp FIN'!A173","v":"Pas de questions ou d'autres remarques"}]
["Merci de répondre ici ou de mentionner le nom de l'annexe à laquelle vous souhaitez faire référence et d'agrandir la céllule en fonction de la langueur de votre réponse, svp."]
[{"$f":"'Questions suppl Rapp FIN'!A174","v":"Pas de questions ou d'autres remarques"}]
["Merci de répondre ici ou de mentionner le nom de l'annexe à laquelle vous souhaitez faire référence et d'agrandir la céllule en fonction de la langueur de votre réponse, svp."]
[{"$f":"'Questions suppl Rapp FIN'!A175","v":"Pas de questions ou d'autres remarques"}]
["Merci de répondre ici ou de mentionner le nom de l'annexe à laquelle vous souhaitez faire référence et d'agrandir la céllule en fonction de la langueur de votre réponse, svp."]
[{"$f":"'Questions suppl Rapp FIN'!A176","v":"Pas de questions ou d'autres remarques"}]
["Merci de répondre ici ou de mentionner le nom de l'annexe à laquelle vous souhaitez faire référence et d'agrandir la céllule en fonction de la langueur de votre réponse, svp."]
[{"$f":"'Questions suppl Rapp FIN'!A177","v":"Pas de questions ou d'autres remarques"}]
["Merci de répondre ici ou de mentionner le nom de l'annexe à laquelle vous souhaitez faire référence et d'agrandir la céllule en fonction de la langueur de votre réponse, svp."]
[{"$f":"'Questions suppl Rapp FIN'!A178","v":"Pas de questions ou d'autres remarques"}]
["Merci de répondre ici ou de mentionner le nom de l'annexe à laquelle vous souhaitez faire référence et d'agrandir la céllule en fonction de la langueur de votre réponse, svp."]
[{"$f":"'Questions suppl Rapp FIN'!A179","v":"Pas de questions ou d'autres remarques"}]
["Merci de répondre ici ou de mentionner le nom de l'annexe à laquelle vous souhaitez faire référence et d'agrandir la céllule en fonction de la langueur de votre réponse, svp."]
[{"$f":"'Questions suppl Rapp FIN'!A180","v":"Pas de questions ou d'autres remarques"}]
["Merci de répondre ici ou de mentionner le nom de l'annexe à laquelle vous souhaitez faire référence et d'agrandir la céllule en fonction de la langueur de votre réponse, svp."]
[{"$f":"'Questions suppl Rapp FIN'!A181","v":"Pas de questions ou d'autres remarques"}]
["Merci de répondre ici ou de mentionner le nom de l'annexe à laquelle vous souhaitez faire référence et d'agrandir la céllule en fonction de la langueur de votre réponse, svp."]
[{"$f":"'Questions suppl Rapp FIN'!A182","v":"Pas de questions ou d'autres remarques"}]
["Merci de répondre ici ou de mentionner le nom de l'annexe à laquelle vous souhaitez faire référence et d'agrandir la céllule en fonction de la langueur de votre réponse, svp."]
[{"$f":"'Questions suppl Rapp FIN'!A183","v":"Pas de questions ou d'autres remarques"}]
["Merci de répondre ici ou de mentionner le nom de l'annexe à laquelle vous souhaitez faire référence et d'agrandir la céllule en fonction de la langueur de votre réponse, svp."]
[{"$f":"'Questions suppl Rapp FIN'!A184","v":"Pas de questions ou d'autres remarques"}]
["Merci de répondre ici ou de mentionner le nom de l'annexe à laquelle vous souhaitez faire référence et d'agrandir la céllule en fonction de la langueur de votre réponse, svp."]
[{"$f":"'Questions suppl Rapp FIN'!A185","v":"Pas de questions ou d'autres remarques"}]
["Merci de répondre ici ou de mentionner le nom de l'annexe à laquelle vous souhaitez faire référence et d'agrandir la céllule en fonction de la langueur de votre réponse, svp."]
[{"$f":"'Questions suppl Rapp FIN'!A186","v":"Pas de questions ou d'autres remarques"}]
["Merci de répondre ici ou de mentionner le nom de l'annexe à laquelle vous souhaitez faire référence et d'agrandir la céllule en fonction de la langueur de votre réponse, svp."]
[{"$f":"'Questions suppl Rapp FIN'!A187","v":"Pas de questions ou d'autres remarques"}]
["Merci de répondre ici ou de mentionner le nom de l'annexe à laquelle vous souhaitez faire référence et d'agrandir la céllule en fonction de la langueur de votre réponse, svp."]
[{"$f":"'Questions suppl Rapp FIN'!A188","v":"Pas de questions ou d'autres remarques"}]
["Merci de répondre ici ou de mentionner le nom de l'annexe à laquelle vous souhaitez faire référence et d'agrandir la céllule en fonction de la langueur de votre réponse, svp."]
[{"$f":"'Questions suppl Rapp FIN'!A189","v":"Pas de questions ou d'autres remarques"}]
["Merci de répondre ici ou de mentionner le nom de l'annexe à laquelle vous souhaitez faire référence et d'agrandir la céllule en fonction de la langueur de votre réponse, svp."]
[{"$f":"'Questions suppl Rapp FIN'!A190","v":"Pas de questions ou d'autres remarques"}]
["Merci de répondre ici ou de mentionner le nom de l'annexe à laquelle vous souhaitez faire référence et d'agrandir la céllule en fonction de la langueur de votre réponse, svp."]
[{"$f":"'Questions suppl Rapp FIN'!A191","v":"Pas de questions ou d'autres remarques"}]
["Merci de répondre ici ou de mentionner le nom de l'annexe à laquelle vous souhaitez faire référence et d'agrandir la céllule en fonction de la langueur de votre réponse, svp."]
[{"$f":"'Questions suppl Rapp FIN'!A192","v":"Pas de questions ou d'autres remarques"}]
["Merci de répondre ici ou de mentionner le nom de l'annexe à laquelle vous souhaitez faire référence et d'agrandir la céllule en fonction de la langueur de votre réponse, svp."]
[{"$f":"'Questions suppl Rapp FIN'!A193","v":"Pas de questions ou d'autres remarques"}]
["Merci de répondre ici ou de mentionner le nom de l'annexe à laquelle vous souhaitez faire référence et d'agrandir la céllule en fonction de la langueur de votre réponse, svp."]
[{"$f":"'Questions suppl Rapp FIN'!A194","v":"Pas de questions ou d'autres remarques"}]
["Merci de répondre ici ou de mentionner le nom de l'annexe à laquelle vous souhaitez faire référence et d'agrandir la céllule en fonction de la langueur de votre réponse, svp."]
[{"$f":"'Questions suppl Rapp FIN'!A195","v":"Pas de questions ou d'autres remarques"}]
["Merci de répondre ici ou de mentionner le nom de l'annexe à laquelle vous souhaitez faire référence et d'agrandir la céllule en fonction de la langueur de votre réponse, svp."]
[{"$f":"'Questions suppl Rapp FIN'!A196","v":"Pas de questions ou d'autres remarques"}]
["Merci de répondre ici ou de mentionner le nom de l'annexe à laquelle vous souhaitez faire référence et d'agrandir la céllule en fonction de la langueur de votre réponse, svp."]
[{"$f":"'Questions suppl Rapp FIN'!A197","v":"Pas de questions ou d'autres remarques"}]
["Merci de répondre ici ou de mentionner le nom de l'annexe à laquelle vous souhaitez faire référence et d'agrandir la céllule en fonction de la langueur de votre réponse, svp."]
[{"$f":"'Questions suppl Rapp FIN'!A198","v":"Pas de questions ou d'autres remarques"}]
["Merci de répondre ici ou de mentionner le nom de l'annexe à laquelle vous souhaitez faire référence et d'agrandir la céllule en fonction de la langueur de votre réponse, svp."]
[{"$f":"'Questions suppl Rapp FIN'!A199","v":"Pas de questions ou d'autres remarques"}]
["Merci de répondre ici ou de mentionner le nom de l'annexe à laquelle vous souhaitez faire référence et d'agrandir la céllule en fonction de la langueur de votre réponse, svp."]
[{"$f":"'Questions suppl Rapp FIN'!A200","v":"Pas de questions ou d'autres remarques"}]
["Merci de répondre ici ou de mentionner le nom de l'annexe à laquelle vous souhaitez faire référence et d'agrandir la céllule en fonction de la langueur de votre réponse, svp."]
[{"$f":"'Questions suppl Rapp FIN'!A201","v":"Pas de questions ou d'autres remarques"}]
["Merci de répondre ici ou de mentionner le nom de l'annexe à laquelle vous souhaitez faire référence et d'agrandir la céllule en fonction de la langueur de votre réponse, svp."]
[{"$f":"'Questions suppl Rapp FIN'!A202","v":"Pas de questions ou d'autres remarques"}]
["Merci de répondre ici ou de mentionner le nom de l'annexe à laquelle vous souhaitez faire référence et d'agrandir la céllule en fonction de la langueur de votre réponse, svp."]
[{"$f":"'Questions suppl Rapp FIN'!A203","v":"Pas de questions ou d'autres remarques"}]
["Merci de répondre ici ou de mentionner le nom de l'annexe à laquelle vous souhaitez faire référence et d'agrandir la céllule en fonction de la langueur de votre réponse, svp."]
[{"$f":"'Questions suppl Rapp FIN'!A204","v":"Pas de questions ou d'autres remarques"}]
["Merci de répondre ici ou de mentionner le nom de l'annexe à laquelle vous souhaitez faire référence et d'agrandir la céllule en fonction de la langueur de votre réponse, svp."]
[{"$f":"'Questions suppl Rapp FIN'!A205","v":"Pas de questions ou d'autres remarques"}]
["Merci de répondre ici ou de mentionner le nom de l'annexe à laquelle vous souhaitez faire référence et d'agrandir la céllule en fonction de la langueur de votre réponse, svp."]
[{"$f":"'Questions suppl Rapp FIN'!A206","v":"Pas de questions ou d'autres remarques"}]
["Merci de répondre ici ou de mentionner le nom de l'annexe à laquelle vous souhaitez faire référence et d'agrandir la céllule en fonction de la langueur de votre réponse, svp."]
[{"$f":"'Questions suppl Rapp FIN'!A207","v":"Pas de questions ou d'autres remarques"}]
["Merci de répondre ici ou de mentionner le nom de l'annexe à laquelle vous souhaitez faire référence et d'agrandir la céllule en fonction de la langueur de votre réponse, svp."]
[{"$f":"'Questions suppl Rapp FIN'!A208","v":"Pas de questions ou d'autres remarques"}]
["Merci de répondre ici ou de mentionner le nom de l'annexe à laquelle vous souhaitez faire référence et d'agrandir la céllule en fonction de la langueur de votre réponse, svp."]
[{"$f":"'Questions suppl Rapp FIN'!A209","v":"Pas de questions ou d'autres remarques"}]
["Merci de répondre ici ou de mentionner le nom de l'annexe à laquelle vous souhaitez faire référence et d'agrandir la céllule en fonction de la langueur de votre réponse, svp."]
[{"$f":"'Questions suppl Rapp FIN'!A210","v":"Pas de questions ou d'autres remarques"}]
["Merci de répondre ici ou de mentionner le nom de l'annexe à laquelle vous souhaitez faire référence et d'agrandir la céllule en fonction de la langueur de votre réponse, svp."]
[{"$f":"'Questions suppl Rapp FIN'!A211","v":"Pas de questions ou d'autres remarques"}]
["Merci de répondre ici ou de mentionner le nom de l'annexe à laquelle vous souhaitez faire référence et d'agrandir la céllule en fonction de la langueur de votre réponse, svp."]
[]
["INVESTISSMENTS:"]
[]
[{"$f":"'Questions suppl Rapp FIN'!A215","v":"Pas de questions ou d'autres remarques"}]
["Merci de répondre ici ou de mentionner le nom de l'annexe à laquelle vous souhaitez faire référence et d'agrandir la céllule en fonction de la langueur de votre réponse, svp."]
[{"$f":"'Questions suppl Rapp FIN'!A216","v":"Pas de questions ou d'autres remarques"}]
["Merci de répondre ici ou de mentionner le nom de l'annexe à laquelle vous souhaitez faire référence et d'agrandir la céllule en fonction de la langueur de votre réponse, svp."]
[{"$f":"'Questions suppl Rapp FIN'!A217","v":"Pas de questions ou d'autres remarques"}]
["Merci de répondre ici ou de mentionner le nom de l'annexe à laquelle vous souhaitez faire référence et d'agrandir la céllule en fonction de la langueur de votre réponse, svp."]
[{"$f":"'Questions suppl Rapp FIN'!A218","v":"Pas de questions ou d'autres remarques"}]
["Merci de répondre ici ou de mentionner le nom de l'annexe à laquelle vous souhaitez faire référence et d'agrandir la céllule en fonction de la langueur de votre réponse, svp."]
[{"$f":"'Questions suppl Rapp FIN'!A219","v":"Pas de questions ou d'autres remarques"}]
["Merci de répondre ici ou de mentionner le nom de l'annexe à laquelle vous souhaitez faire référence et d'agrandir la céllule en fonction de la langueur de votre réponse, svp."]
[]
["FRAIS DE FONCTIONNEMENT DIRECTS"]
[]
[{"$f":"'Questions suppl Rapp FIN'!A223","v":"Choisissez dans la liste Frais de fonctionnement directs "}]
[]
[{"$f":"'Questions suppl Rapp FIN'!A225","v":"Pas de questions ou d'autres remarques"}]
["Merci de répondre ici ou de mentionner le nom de l'annexe à laquelle vous souhaitez faire référence et d'agrandir la céllule en fonction de la langueur de votre réponse, svp."]
[{"$f":"'Questions suppl Rapp FIN'!A226","v":"Pas de questions ou d'autres remarques"}]
["Merci de répondre ici ou de mentionner le nom de l'annexe à laquelle vous souhaitez faire référence et d'agrandir la céllule en fonction de la langueur de votre réponse, svp."]
[{"$f":"'Questions suppl Rapp FIN'!A227","v":"Pas de questions ou d'autres remarques"}]
["Merci de répondre ici ou de mentionner le nom de l'annexe à laquelle vous souhaitez faire référence et d'agrandir la céllule en fonction de la langueur de votre réponse, svp."]
[{"$f":"'Questions suppl Rapp FIN'!A228","v":"Pas de questions ou d'autres remarques"}]
["Merci de répondre ici ou de mentionner le nom de l'annexe à laquelle vous souhaitez faire référence et d'agrandir la céllule en fonction de la langueur de votre réponse, svp."]
[{"$f":"'Questions suppl Rapp FIN'!A229","v":"Pas de questions ou d'autres remarques"}]
["Merci de répondre ici ou de mentionner le nom de l'annexe à laquelle vous souhaitez faire référence et d'agrandir la céllule en fonction de la langueur de votre réponse, svp."]
[{"$f":"'Questions suppl Rapp FIN'!A230","v":"Pas de questions ou d'autres remarques"}]
["Merci de répondre ici ou de mentionner le nom de l'annexe à laquelle vous souhaitez faire référence et d'agrandir la céllule en fonction de la langueur de votre réponse, svp."]
[{"$f":"'Questions suppl Rapp FIN'!A231","v":"Pas de questions ou d'autres remarques"}]
["Merci de répondre ici ou de mentionner le nom de l'annexe à laquelle vous souhaitez faire référence et d'agrandir la céllule en fonction de la langueur de votre réponse, svp."]
[{"$f":"'Questions suppl Rapp FIN'!A232","v":"Pas de questions ou d'autres remarques"}]
["Merci de répondre ici ou de mentionner le nom de l'annexe à laquelle vous souhaitez faire référence et d'agrandir la céllule en fonction de la langueur de votre réponse, svp."]
[{"$f":"'Questions suppl Rapp FIN'!A233","v":"Pas de questions ou d'autres remarques"}]
["Merci de répondre ici ou de mentionner le nom de l'annexe à laquelle vous souhaitez faire référence et d'agrandir la céllule en fonction de la langueur de votre réponse, svp."]
[{"$f":"'Questions suppl Rapp FIN'!A234","v":"Pas de questions ou d'autres remarques"}]
["Merci de répondre ici ou de mentionner le nom de l'annexe à laquelle vous souhaitez faire référence et d'agrandir la céllule en fonction de la langueur de votre réponse, svp."]
[{"$f":"'Questions suppl Rapp FIN'!A235","v":"Pas de questions ou d'autres remarques"}]
["Merci de répondre ici ou de mentionner le nom de l'annexe à laquelle vous souhaitez faire référence et d'agrandir la céllule en fonction de la langueur de votre réponse, svp."]
[{"$f":"'Questions suppl Rapp FIN'!A236","v":"Pas de questions ou d'autres remarques"}]
["Merci de répondre ici ou de mentionner le nom de l'annexe à laquelle vous souhaitez faire référence et d'agrandir la céllule en fonction de la langueur de votre réponse, svp."]
[{"$f":"'Questions suppl Rapp FIN'!A237","v":"Pas de questions ou d'autres remarques"}]
["Merci de répondre ici ou de mentionner le nom de l'annexe à laquelle vous souhaitez faire référence et d'agrandir la céllule en fonction de la langueur de votre réponse, svp."]
[]
[{"$f":"'Questions suppl Rapp FIN'!A239","v":"Choisissez dans la liste Frais de fonctionnement directs "}]
[]
[{"$f":"'Questions suppl Rapp FIN'!A241","v":"Pas de questions ou d'autres remarques"}]
["Merci de répondre ici ou de mentionner le nom de l'annexe à laquelle vous souhaitez faire référence et d'agrandir la céllule en fonction de la langueur de votre réponse, svp."]
[{"$f":"'Questions suppl Rapp FIN'!A242","v":"Pas de questions ou d'autres remarques"}]
["Merci de répondre ici ou de mentionner le nom de l'annexe à laquelle vous souhaitez faire référence et d'agrandir la céllule en fonction de la langueur de votre réponse, svp."]
[{"$f":"'Questions suppl Rapp FIN'!A243","v":"Pas de questions ou d'autres remarques"}]
["Merci de répondre ici ou de mentionner le nom de l'annexe à laquelle vous souhaitez faire référence et d'agrandir la céllule en fonction de la langueur de votre réponse, svp."]
[{"$f":"'Questions suppl Rapp FIN'!A244","v":"Pas de questions ou d'autres remarques"}]
["Merci de répondre ici ou de mentionner le nom de l'annexe à laquelle vous souhaitez faire référence et d'agrandir la céllule en fonction de la langueur de votre réponse, svp."]
[{"$f":"'Questions suppl Rapp FIN'!A245","v":"Pas de questions ou d'autres remarques"}]
["Merci de répondre ici ou de mentionner le nom de l'annexe à laquelle vous souhaitez faire référence et d'agrandir la céllule en fonction de la langueur de votre réponse, svp."]
[{"$f":"'Questions suppl Rapp FIN'!A246","v":"Pas de questions ou d'autres remarques"}]
["Merci de répondre ici ou de mentionner le nom de l'annexe à laquelle vous souhaitez faire référence et d'agrandir la céllule en fonction de la langueur de votre réponse, svp."]
[{"$f":"'Questions suppl Rapp FIN'!A247","v":"Pas de questions ou d'autres remarques"}]
["Merci de répondre ici ou de mentionner le nom de l'annexe à laquelle vous souhaitez faire référence et d'agrandir la céllule en fonction de la langueur de votre réponse, svp."]
[{"$f":"'Questions suppl Rapp FIN'!A248","v":"Pas de questions ou d'autres remarques"}]
["Merci de répondre ici ou de mentionner le nom de l'annexe à laquelle vous souhaitez faire référence et d'agrandir la céllule en fonction de la langueur de votre réponse, svp."]
[{"$f":"'Questions suppl Rapp FIN'!A249","v":"Pas de questions ou d'autres remarques"}]
["Merci de répondre ici ou de mentionner le nom de l'annexe à laquelle vous souhaitez faire référence et d'agrandir la céllule en fonction de la langueur de votre réponse, svp."]
[{"$f":"'Questions suppl Rapp FIN'!A250","v":"Pas de questions ou d'autres remarques"}]
["Merci de répondre ici ou de mentionner le nom de l'annexe à laquelle vous souhaitez faire référence et d'agrandir la céllule en fonction de la langueur de votre réponse, svp."]
[{"$f":"'Questions suppl Rapp FIN'!A251","v":"Pas de questions ou d'autres remarques"}]
["Merci de répondre ici ou de mentionner le nom de l'annexe à laquelle vous souhaitez faire référence et d'agrandir la céllule en fonction de la langueur de votre réponse, svp."]
[{"$f":"'Questions suppl Rapp FIN'!A252","v":"Pas de questions ou d'autres remarques"}]
["Merci de répondre ici ou de mentionner le nom de l'annexe à laquelle vous souhaitez faire référence et d'agrandir la céllule en fonction de la langueur de votre réponse, svp."]
[{"$f":"'Questions suppl Rapp FIN'!A253","v":"Pas de questions ou d'autres remarques"}]
["Merci de répondre ici ou de mentionner le nom de l'annexe à laquelle vous souhaitez faire référence et d'agrandir la céllule en fonction de la langueur de votre réponse, svp."]
[]
[{"$f":"'Questions suppl Rapp FIN'!A255","v":"Choisissez dans la liste Frais de fonctionnement directs "}]
[]
[{"$f":"'Questions suppl Rapp FIN'!A257","v":"Pas de questions ou d'autres remarques"}]
["Merci de répondre ici ou de mentionner le nom de l'annexe à laquelle vous souhaitez faire référence et d'agrandir la céllule en fonction de la langueur de votre réponse, svp."]
[{"$f":"'Questions suppl Rapp FIN'!A258","v":"Pas de questions ou d'autres remarques"}]
["Merci de répondre ici ou de mentionner le nom de l'annexe à laquelle vous souhaitez faire référence et d'agrandir la céllule en fonction de la langueur de votre réponse, svp."]
[{"$f":"'Questions suppl Rapp FIN'!A259","v":"Pas de questions ou d'autres remarques"}]
["Merci de répondre ici ou de mentionner le nom de l'annexe à laquelle vous souhaitez faire référence et d'agrandir la céllule en fonction de la langueur de votre réponse, svp."]
[{"$f":"'Questions suppl Rapp FIN'!A260","v":"Pas de questions ou d'autres remarques"}]
["Merci de répondre ici ou de mentionner le nom de l'annexe à laquelle vous souhaitez faire référence et d'agrandir la céllule en fonction de la langueur de votre réponse, svp."]
[{"$f":"'Questions suppl Rapp FIN'!A261","v":"Pas de questions ou d'autres remarques"}]
["Merci de répondre ici ou de mentionner le nom de l'annexe à laquelle vous souhaitez faire référence et d'agrandir la céllule en fonction de la langueur de votre réponse, svp."]
[{"$f":"'Questions suppl Rapp FIN'!A262","v":"Pas de questions ou d'autres remarques"}]
["Merci de répondre ici ou de mentionner le nom de l'annexe à laquelle vous souhaitez faire référence et d'agrandir la céllule en fonction de la langueur de votre réponse, svp."]
[{"$f":"'Questions suppl Rapp FIN'!A263","v":"Pas de questions ou d'autres remarques"}]
["Merci de répondre ici ou de mentionner le nom de l'annexe à laquelle vous souhaitez faire référence et d'agrandir la céllule en fonction de la langueur de votre réponse, svp."]
[{"$f":"'Questions suppl Rapp FIN'!A264","v":"Pas de questions ou d'autres remarques"}]
["Merci de répondre ici ou de mentionner le nom de l'annexe à laquelle vous souhaitez faire référence et d'agrandir la céllule en fonction de la langueur de votre réponse, svp."]
[{"$f":"'Questions suppl Rapp FIN'!A265","v":"Pas de questions ou d'autres remarques"}]
["Merci de répondre ici ou de mentionner le nom de l'annexe à laquelle vous souhaitez faire référence et d'agrandir la céllule en fonction de la langueur de votre réponse, svp."]
[{"$f":"'Questions suppl Rapp FIN'!A266","v":"Pas de questions ou d'autres remarques"}]
["Merci de répondre ici ou de mentionner le nom de l'annexe à laquelle vous souhaitez faire référence et d'agrandir la céllule en fonction de la langueur de votre réponse, svp."]
[{"$f":"'Questions suppl Rapp FIN'!A267","v":"Pas de questions ou d'autres remarques"}]
["Merci de répondre ici ou de mentionner le nom de l'annexe à laquelle vous souhaitez faire référence et d'agrandir la céllule en fonction de la langueur de votre réponse, svp."]
[{"$f":"'Questions suppl Rapp FIN'!A268","v":"Pas de questions ou d'autres remarques"}]
["Merci de répondre ici ou de mentionner le nom de l'annexe à laquelle vous souhaitez faire référence et d'agrandir la céllule en fonction de la langueur de votre réponse, svp."]
[{"$f":"'Questions suppl Rapp FIN'!A269","v":"Pas de questions ou d'autres remarques"}]
["Merci de répondre ici ou de mentionner le nom de l'annexe à laquelle vous souhaitez faire référence et d'agrandir la céllule en fonction de la langueur de votre réponse, svp."]
[]
[{"$f":"'Questions suppl Rapp FIN'!A271","v":"Choisissez dans la liste Frais de fonctionnement directs "}]
[]
[{"$f":"'Questions suppl Rapp FIN'!A273","v":"Pas de questions ou d'autres remarques"}]
["Merci de répondre ici ou de mentionner le nom de l'annexe à laquelle vous souhaitez faire référence et d'agrandir la céllule en fonction de la langueur de votre réponse, svp."]
[{"$f":"'Questions suppl Rapp FIN'!A274","v":"Pas de questions ou d'autres remarques"}]
["Merci de répondre ici ou de mentionner le nom de l'annexe à laquelle vous souhaitez faire référence et d'agrandir la céllule en fonction de la langueur de votre réponse, svp."]
[{"$f":"'Questions suppl Rapp FIN'!A275","v":"Pas de questions ou d'autres remarques"}]
["Merci de répondre ici ou de mentionner le nom de l'annexe à laquelle vous souhaitez faire référence et d'agrandir la céllule en fonction de la langueur de votre réponse, svp."]
[{"$f":"'Questions suppl Rapp FIN'!A276","v":"Pas de questions ou d'autres remarques"}]
["Merci de répondre ici ou de mentionner le nom de l'annexe à laquelle vous souhaitez faire référence et d'agrandir la céllule en fonction de la langueur de votre réponse, svp."]
[{"$f":"'Questions suppl Rapp FIN'!A277","v":"Pas de questions ou d'autres remarques"}]
["Merci de répondre ici ou de mentionner le nom de l'annexe à laquelle vous souhaitez faire référence et d'agrandir la céllule en fonction de la langueur de votre réponse, svp."]
[{"$f":"'Questions suppl Rapp FIN'!A278","v":"Pas de questions ou d'autres remarques"}]
["Merci de répondre ici ou de mentionner le nom de l'annexe à laquelle vous souhaitez faire référence et d'agrandir la céllule en fonction de la langueur de votre réponse, svp."]
[{"$f":"'Questions suppl Rapp FIN'!A279","v":"Pas de questions ou d'autres remarques"}]
["Merci de répondre ici ou de mentionner le nom de l'annexe à laquelle vous souhaitez faire référence et d'agrandir la céllule en fonction de la langueur de votre réponse, svp."]
[{"$f":"'Questions suppl Rapp FIN'!A280","v":"Pas de questions ou d'autres remarques"}]
["Merci de répondre ici ou de mentionner le nom de l'annexe à laquelle vous souhaitez faire référence et d'agrandir la céllule en fonction de la langueur de votre réponse, svp."]
[{"$f":"'Questions suppl Rapp FIN'!A281","v":"Pas de questions ou d'autres remarques"}]
["Merci de répondre ici ou de mentionner le nom de l'annexe à laquelle vous souhaitez faire référence et d'agrandir la céllule en fonction de la langueur de votre réponse, svp."]
[{"$f":"'Questions suppl Rapp FIN'!A282","v":"Pas de questions ou d'autres remarques"}]
["Merci de répondre ici ou de mentionner le nom de l'annexe à laquelle vous souhaitez faire référence et d'agrandir la céllule en fonction de la langueur de votre réponse, svp."]
[{"$f":"'Questions suppl Rapp FIN'!A283","v":"Pas de questions ou d'autres remarques"}]
["Merci de répondre ici ou de mentionner le nom de l'annexe à laquelle vous souhaitez faire référence et d'agrandir la céllule en fonction de la langueur de votre réponse, svp."]
[{"$f":"'Questions suppl Rapp FIN'!A284","v":"Pas de questions ou d'autres remarques"}]
["Merci de répondre ici ou de mentionner le nom de l'annexe à laquelle vous souhaitez faire référence et d'agrandir la céllule en fonction de la langueur de votre réponse, svp."]
[{"$f":"'Questions suppl Rapp FIN'!A285","v":"Pas de questions ou d'autres remarques"}]
["Merci de répondre ici ou de mentionner le nom de l'annexe à laquelle vous souhaitez faire référence et d'agrandir la céllule en fonction de la langueur de votre réponse, svp."]
[]
[{"$f":"'Questions suppl Rapp FIN'!A287","v":"Choisissez dans la liste Frais de fonctionnement directs "}]
[]
[{"$f":"'Questions suppl Rapp FIN'!A289","v":"Pas de questions ou d'autres remarques"}]
["Merci de répondre ici ou de mentionner le nom de l'annexe à laquelle vous souhaitez faire référence et d'agrandir la céllule en fonction de la langueur de votre réponse, svp."]
[{"$f":"'Questions suppl Rapp FIN'!A290","v":"Pas de questions ou d'autres remarques"}]
["Merci de répondre ici ou de mentionner le nom de l'annexe à laquelle vous souhaitez faire référence et d'agrandir la céllule en fonction de la langueur de votre réponse, svp."]
[{"$f":"'Questions suppl Rapp FIN'!A291","v":"Pas de questions ou d'autres remarques"}]
["Merci de répondre ici ou de mentionner le nom de l'annexe à laquelle vous souhaitez faire référence et d'agrandir la céllule en fonction de la langueur de votre réponse, svp."]
[{"$f":"'Questions suppl Rapp FIN'!A292","v":"Pas de questions ou d'autres remarques"}]
["Merci de répondre ici ou de mentionner le nom de l'annexe à laquelle vous souhaitez faire référence et d'agrandir la céllule en fonction de la langueur de votre réponse, svp."]
[{"$f":"'Questions suppl Rapp FIN'!A293","v":"Pas de questions ou d'autres remarques"}]
["Merci de répondre ici ou de mentionner le nom de l'annexe à laquelle vous souhaitez faire référence et d'agrandir la céllule en fonction de la langueur de votre réponse, svp."]
[{"$f":"'Questions suppl Rapp FIN'!A294","v":"Pas de questions ou d'autres remarques"}]
["Merci de répondre ici ou de mentionner le nom de l'annexe à laquelle vous souhaitez faire référence et d'agrandir la céllule en fonction de la langueur de votre réponse, svp."]
[{"$f":"'Questions suppl Rapp FIN'!A295","v":"Pas de questions ou d'autres remarques"}]
["Merci de répondre ici ou de mentionner le nom de l'annexe à laquelle vous souhaitez faire référence et d'agrandir la céllule en fonction de la langueur de votre réponse, svp."]
[{"$f":"'Questions suppl Rapp FIN'!A296","v":"Pas de questions ou d'autres remarques"}]
["Merci de répondre ici ou de mentionner le nom de l'annexe à laquelle vous souhaitez faire référence et d'agrandir la céllule en fonction de la langueur de votre réponse, svp."]
[{"$f":"'Questions suppl Rapp FIN'!A297","v":"Pas de questions ou d'autres remarques"}]
["Merci de répondre ici ou de mentionner le nom de l'annexe à laquelle vous souhaitez faire référence et d'agrandir la céllule en fonction de la langueur de votre réponse, svp."]
[{"$f":"'Questions suppl Rapp FIN'!A298","v":"Pas de questions ou d'autres remarques"}]
["Merci de répondre ici ou de mentionner le nom de l'annexe à laquelle vous souhaitez faire référence et d'agrandir la céllule en fonction de la langueur de votre réponse, svp."]
[{"$f":"'Questions suppl Rapp FIN'!A299","v":"Pas de questions ou d'autres remarques"}]
["Merci de répondre ici ou de mentionner le nom de l'annexe à laquelle vous souhaitez faire référence et d'agrandir la céllule en fonction de la langueur de votre réponse, svp."]
[{"$f":"'Questions suppl Rapp FIN'!A300","v":"Pas de questions ou d'autres remarques"}]
["Merci de répondre ici ou de mentionner le nom de l'annexe à laquelle vous souhaitez faire référence et d'agrandir la céllule en fonction de la langueur de votre réponse, svp"]
[{"$f":"'Questions suppl Rapp FIN'!A301","v":"Pas de questions ou d'autres remarques"}]
["Merci de répondre ici ou de mentionner le nom de l'annexe à laquelle vous souhaitez faire référence et d'agrandir la céllule en fonction de la langueur de votre réponse, svp."]
[]
[{"$f":"'Questions suppl Rapp FIN'!A303","v":"Choisissez dans la liste Frais de fonctionnement directs "}]
[]
[{"$f":"'Questions suppl Rapp FIN'!A305","v":"Pas de questions ou d'autres remarques"}]
["Merci de répondre ici ou de mentionner le nom de l'annexe à laquelle vous souhaitez faire référence et d'agrandir la céllule en fonction de la langueur de votre réponse, svp."]
[{"$f":"'Questions suppl Rapp FIN'!A306","v":"Pas de questions ou d'autres remarques"}]
["Merci de répondre ici ou de mentionner le nom de l'annexe à laquelle vous souhaitez faire référence et d'agrandir la céllule en fonction de la langueur de votre réponse, svp."]
[{"$f":"'Questions suppl Rapp FIN'!A307","v":"Pas de questions ou d'autres remarques"}]
["Merci de répondre ici ou de mentionner le nom de l'annexe à laquelle vous souhaitez faire référence et d'agrandir la céllule en fonction de la langueur de votre réponse, svp."]
[{"$f":"'Questions suppl Rapp FIN'!A308","v":"Pas de questions ou d'autres remarques"}]
["Merci de répondre ici ou de mentionner le nom de l'annexe à laquelle vous souhaitez faire référence et d'agrandir la céllule en fonction de la langueur de votre réponse, svp."]
[{"$f":"'Questions suppl Rapp FIN'!A309","v":"Pas de questions ou d'autres remarques"}]
["Merci de répondre ici ou de mentionner le nom de l'annexe à laquelle vous souhaitez faire référence et d'agrandir la céllule en fonction de la langueur de votre réponse, svp."]
[{"$f":"'Questions suppl Rapp FIN'!A310","v":"Pas de questions ou d'autres remarques"}]
["Merci de répondre ici ou de mentionner le nom de l'annexe à laquelle vous souhaitez faire référence et d'agrandir la céllule en fonction de la langueur de votre réponse, svp."]
[{"$f":"'Questions suppl Rapp FIN'!A311","v":"Pas de questions ou d'autres remarques"}]
["Merci de répondre ici ou de mentionner le nom de l'annexe à laquelle vous souhaitez faire référence et d'agrandir la céllule en fonction de la langueur de votre réponse, svp."]
[{"$f":"'Questions suppl Rapp FIN'!A312","v":"Pas de questions ou d'autres remarques"}]
["Merci de répondre ici ou de mentionner le nom de l'annexe à laquelle vous souhaitez faire référence et d'agrandir la céllule en fonction de la langueur de votre réponse, svp."]
[{"$f":"'Questions suppl Rapp FIN'!A313","v":"Pas de questions ou d'autres remarques"}]
["Merci de répondre ici ou de mentionner le nom de l'annexe à laquelle vous souhaitez faire référence et d'agrandir la céllule en fonction de la langueur de votre réponse, svp."]
[{"$f":"'Questions suppl Rapp FIN'!A314","v":"Pas de questions ou d'autres remarques"}]
["Merci de répondre ici ou de mentionner le nom de l'annexe à laquelle vous souhaitez faire référence et d'agrandir la céllule en fonction de la langueur de votre réponse, svp."]
[{"$f":"'Questions suppl Rapp FIN'!A315","v":"Pas de questions ou d'autres remarques"}]
["Merci de répondre ici ou de mentionner le nom de l'annexe à laquelle vous souhaitez faire référence et d'agrandir la céllule en fonction de la langueur de votre réponse, svp."]
[{"$f":"'Questions suppl Rapp FIN'!A316","v":"Pas de questions ou d'autres remarques"}]
["Merci de répondre ici ou de mentionner le nom de l'annexe à laquelle vous souhaitez faire référence et d'agrandir la céllule en fonction de la langueur de votre réponse, svp."]
[{"$f":"'Questions suppl Rapp FIN'!A317","v":"Pas de questions ou d'autres remarques"}]
["Merci de répondre ici ou de mentionner le nom de l'annexe à laquelle vous souhaitez faire référence et d'agrandir la céllule en fonction de la langueur de votre réponse, svp."]
[]
[{"$f":"'Questions suppl Rapp FIN'!A319","v":"Choisissez dans la liste Frais de fonctionnement directs "}]
[]
[{"$f":"'Questions suppl Rapp FIN'!A321","v":"Pas de questions ou d'autres remarques"}]
["Merci de répondre ici ou de mentionner le nom de l'annexe à laquelle vous souhaitez faire référence et d'agrandir la céllule en fonction de la langueur de votre réponse, svp."]
[{"$f":"'Questions suppl Rapp FIN'!A322","v":"Pas de questions ou d'autres remarques"}]
["Merci de répondre ici ou de mentionner le nom de l'annexe à laquelle vous souhaitez faire référence et d'agrandir la céllule en fonction de la langueur de votre réponse, svp."]
[{"$f":"'Questions suppl Rapp FIN'!A323","v":"Pas de questions ou d'autres remarques"}]
["Merci de répondre ici ou de mentionner le nom de l'annexe à laquelle vous souhaitez faire référence et d'agrandir la céllule en fonction de la langueur de votre réponse, svp."]
[{"$f":"'Questions suppl Rapp FIN'!A324","v":"Pas de questions ou d'autres remarques"}]
["Merci de répondre ici ou de mentionner le nom de l'annexe à laquelle vous souhaitez faire référence et d'agrandir la céllule en fonction de la langueur de votre réponse, svp."]
[{"$f":"'Questions suppl Rapp FIN'!A325","v":"Pas de questions ou d'autres remarques"}]
["Merci de répondre ici ou de mentionner le nom de l'annexe à laquelle vous souhaitez faire référence et d'agrandir la céllule en fonction de la langueur de votre réponse, svp."]
[{"$f":"'Questions suppl Rapp FIN'!A326","v":"Pas de questions ou d'autres remarques"}]
["Merci de répondre ici ou de mentionner le nom de l'annexe à laquelle vous souhaitez faire référence et d'agrandir la céllule en fonction de la langueur de votre réponse, svp."]
[{"$f":"'Questions suppl Rapp FIN'!A327","v":"Pas de questions ou d'autres remarques"}]
["Merci de répondre ici ou de mentionner le nom de l'annexe à laquelle vous souhaitez faire référence et d'agrandir la céllule en fonction de la langueur de votre réponse, svp."]
[{"$f":"'Questions suppl Rapp FIN'!A328","v":"Pas de questions ou d'autres remarques"}]
["Merci de répondre ici ou de mentionner le nom de l'annexe à laquelle vous souhaitez faire référence et d'agrandir la céllule en fonction de la langueur de votre réponse, svp."]
[{"$f":"'Questions suppl Rapp FIN'!A329","v":"Pas de questions ou d'autres remarques"}]
["Merci de répondre ici ou de mentionner le nom de l'annexe à laquelle vous souhaitez faire référence et d'agrandir la céllule en fonction de la langueur de votre réponse, svp."]
[{"$f":"'Questions suppl Rapp FIN'!A330","v":"Pas de questions ou d'autres remarques"}]
["Merci de répondre ici ou de mentionner le nom de l'annexe à laquelle vous souhaitez faire référence et d'agrandir la céllule en fonction de la langueur de votre réponse, svp."]
[{"$f":"'Questions suppl Rapp FIN'!A331","v":"Pas de questions ou d'autres remarques"}]
["Merci de répondre ici ou de mentionner le nom de l'annexe à laquelle vous souhaitez faire référence et d'agrandir la céllule en fonction de la langueur de votre réponse, svp."]
[{"$f":"'Questions suppl Rapp FIN'!A332","v":"Pas de questions ou d'autres remarques"}]
["Merci de répondre ici ou de mentionner le nom de l'annexe à laquelle vous souhaitez faire référence et d'agrandir la céllule en fonction de la langueur de votre réponse, svp."]
[{"$f":"'Questions suppl Rapp FIN'!A333","v":"Pas de questions ou d'autres remarques"}]
["Merci de répondre ici ou de mentionner le nom de l'annexe à laquelle vous souhaitez faire référence et d'agrandir la céllule en fonction de la langueur de votre réponse, svp."]
[]
[{"$f":"'Questions suppl Rapp FIN'!A335","v":"Choisissez dans la liste Frais de fonctionnement directs "}]
[]
[{"$f":"'Questions suppl Rapp FIN'!A337","v":"Pas de questions ou d'autres remarques"}]
["Merci de répondre ici ou de mentionner le nom de l'annexe à laquelle vous souhaitez faire référence et d'agrandir la céllule en fonction de la langueur de votre réponse, svp."]
[{"$f":"'Questions suppl Rapp FIN'!A338","v":"Pas de questions ou d'autres remarques"}]
["Merci de répondre ici ou de mentionner le nom de l'annexe à laquelle vous souhaitez faire référence et d'agrandir la céllule en fonction de la langueur de votre réponse, svp."]
[{"$f":"'Questions suppl Rapp FIN'!A339","v":"Pas de questions ou d'autres remarques"}]
["Merci de répondre ici ou de mentionner le nom de l'annexe à laquelle vous souhaitez faire référence et d'agrandir la céllule en fonction de la langueur de votre réponse, svp."]
[{"$f":"'Questions suppl Rapp FIN'!A340","v":"Pas de questions ou d'autres remarques"}]
["Merci de répondre ici ou de mentionner le nom de l'annexe à laquelle vous souhaitez faire référence et d'agrandir la céllule en fonction de la langueur de votre réponse, svp."]
[{"$f":"'Questions suppl Rapp FIN'!A341","v":"Pas de questions ou d'autres remarques"}]
["Merci de répondre ici ou de mentionner le nom de l'annexe à laquelle vous souhaitez faire référence et d'agrandir la céllule en fonction de la langueur de votre réponse, svp."]
[{"$f":"'Questions suppl Rapp FIN'!A342","v":"Pas de questions ou d'autres remarques"}]
["Merci de répondre ici ou de mentionner le nom de l'annexe à laquelle vous souhaitez faire référence et d'agrandir la céllule en fonction de la langueur de votre réponse, svp."]
[{"$f":"'Questions suppl Rapp FIN'!A343","v":"Pas de questions ou d'autres remarques"}]
["Merci de répondre ici ou de mentionner le nom de l'annexe à laquelle vous souhaitez faire référence et d'agrandir la céllule en fonction de la langueur de votre réponse, svp."]
[{"$f":"'Questions suppl Rapp FIN'!A344","v":"Pas de questions ou d'autres remarques"}]
["Merci de répondre ici ou de mentionner le nom de l'annexe à laquelle vous souhaitez faire référence et d'agrandir la céllule en fonction de la langueur de votre réponse, svp."]
[{"$f":"'Questions suppl Rapp FIN'!A345","v":"Pas de questions ou d'autres remarques"}]
["Merci de répondre ici ou de mentionner le nom de l'annexe à laquelle vous souhaitez faire référence et d'agrandir la céllule en fonction de la langueur de votre réponse, svp."]
[{"$f":"'Questions suppl Rapp FIN'!A346","v":"Pas de questions ou d'autres remarques"}]
["Merci de répondre ici ou de mentionner le nom de l'annexe à laquelle vous souhaitez faire référence et d'agrandir la céllule en fonction de la langueur de votre réponse, svp."]
[{"$f":"'Questions suppl Rapp FIN'!A347","v":"Pas de questions ou d'autres remarques"}]
["Merci de répondre ici ou de mentionner le nom de l'annexe à laquelle vous souhaitez faire référence et d'agrandir la céllule en fonction de la langueur de votre réponse, svp."]
[{"$f":"'Questions suppl Rapp FIN'!A348","v":"Pas de questions ou d'autres remarques"}]
["Merci de répondre ici ou de mentionner le nom de l'annexe à laquelle vous souhaitez faire référence et d'agrandir la céllule en fonction de la langueur de votre réponse, svp."]
[{"$f":"'Questions suppl Rapp FIN'!A349","v":"Pas de questions ou d'autres remarques"}]
["Merci de répondre ici ou de mentionner le nom de l'annexe à laquelle vous souhaitez faire référence et d'agrandir la céllule en fonction de la langueur de votre réponse, svp."]
[]
[{"$f":"'Questions suppl Rapp FIN'!A351","v":"Choisissez dans la liste Frais de fonctionnement directs "}]
[]
[{"$f":"'Questions suppl Rapp FIN'!A353","v":"Pas de questions ou d'autres remarques"}]
["Merci de répondre ici ou de mentionner le nom de l'annexe à laquelle vous souhaitez faire référence et d'agrandir la céllule en fonction de la langueur de votre réponse, svp."]
[{"$f":"'Questions suppl Rapp FIN'!A354","v":"Pas de questions ou d'autres remarques"}]
["Merci de répondre ici ou de mentionner le nom de l'annexe à laquelle vous souhaitez faire référence et d'agrandir la céllule en fonction de la langueur de votre réponse, svp."]
[{"$f":"'Questions suppl Rapp FIN'!A355","v":"Pas de questions ou d'autres remarques"}]
["Merci de répondre ici ou de mentionner le nom de l'annexe à laquelle vous souhaitez faire référence et d'agrandir la céllule en fonction de la langueur de votre réponse, svp."]
[{"$f":"'Questions suppl Rapp FIN'!A356","v":"Pas de questions ou d'autres remarques"}]
["Merci de répondre ici ou de mentionner le nom de l'annexe à laquelle vous souhaitez faire référence et d'agrandir la céllule en fonction de la langueur de votre réponse, svp."]
[{"$f":"'Questions suppl Rapp FIN'!A357","v":"Pas de questions ou d'autres remarques"}]
["Merci de répondre ici ou de mentionner le nom de l'annexe à laquelle vous souhaitez faire référence et d'agrandir la céllule en fonction de la langueur de votre réponse, svp."]
[{"$f":"'Questions suppl Rapp FIN'!A358","v":"Pas de questions ou d'autres remarques"}]
["Merci de répondre ici ou de mentionner le nom de l'annexe à laquelle vous souhaitez faire référence et d'agrandir la céllule en fonction de la langueur de votre réponse, svp."]
[{"$f":"'Questions suppl Rapp FIN'!A359","v":"Pas de questions ou d'autres remarques"}]
["Merci de répondre ici ou de mentionner le nom de l'annexe à laquelle vous souhaitez faire référence et d'agrandir la céllule en fonction de la langueur de votre réponse, svp."]
[{"$f":"'Questions suppl Rapp FIN'!A360","v":"Pas de questions ou d'autres remarques"}]
["Merci de répondre ici ou de mentionner le nom de l'annexe à laquelle vous souhaitez faire référence et d'agrandir la céllule en fonction de la langueur de votre réponse, svp."]
[{"$f":"'Questions suppl Rapp FIN'!A361","v":"Pas de questions ou d'autres remarques"}]
["Merci de répondre ici ou de mentionner le nom de l'annexe à laquelle vous souhaitez faire référence et d'agrandir la céllule en fonction de la langueur de votre réponse, svp."]
[{"$f":"'Questions suppl Rapp FIN'!A362","v":"Pas de questions ou d'autres remarques"}]
["Merci de répondre ici ou de mentionner le nom de l'annexe à laquelle vous souhaitez faire référence et d'agrandir la céllule en fonction de la langueur de votre réponse, svp."]
[{"$f":"'Questions suppl Rapp FIN'!A363","v":"Pas de questions ou d'autres remarques"}]
["Merci de répondre ici ou de mentionner le nom de l'annexe à laquelle vous souhaitez faire référence et d'agrandir la céllule en fonction de la langueur de votre réponse, svp."]
[{"$f":"'Questions suppl Rapp FIN'!A364","v":"Pas de questions ou d'autres remarques"}]
["Merci de répondre ici ou de mentionner le nom de l'annexe à laquelle vous souhaitez faire référence et d'agrandir la céllule en fonction de la langueur de votre réponse, svp."]
[{"$f":"'Questions suppl Rapp FIN'!A365","v":"Pas de questions ou d'autres remarques"}]
["Merci de répondre ici ou de mentionner le nom de l'annexe à laquelle vous souhaitez faire référence et d'agrandir la céllule en fonction de la langueur de votre réponse, svp."]
[]
[{"$f":"'Questions suppl Rapp FIN'!A367","v":"Autre : (compléter soi-même) "}]
[]
[{"$f":"'Questions suppl Rapp FIN'!A369","v":"Pas de questions ou d'autres remarques"}]
["Merci de répondre ici ou de mentionner le nom de l'annexe à laquelle vous souhaitez faire référence et d'agrandir la céllule en fonction de la langueur de votre réponse, svp."]
[{"$f":"'Questions suppl Rapp FIN'!A370","v":"Pas de questions ou d'autres remarques"}]
["Merci de répondre ici ou de mentionner le nom de l'annexe à laquelle vous souhaitez faire référence et d'agrandir la céllule en fonction de la langueur de votre réponse, svp."]
[{"$f":"'Questions suppl Rapp FIN'!A371","v":"Pas de questions ou d'autres remarques"}]
["Merci de répondre ici ou de mentionner le nom de l'annexe à laquelle vous souhaitez faire référence et d'agrandir la céllule en fonction de la langueur de votre réponse, svp."]
[{"$f":"'Questions suppl Rapp FIN'!A372","v":"Pas de questions ou d'autres remarques"}]
["Merci de répondre ici ou de mentionner le nom de l'annexe à laquelle vous souhaitez faire référence et d'agrandir la céllule en fonction de la langueur de votre réponse, svp."]
[{"$f":"'Questions suppl Rapp FIN'!A373","v":"Pas de questions ou d'autres remarques"}]
["Merci de répondre ici ou de mentionner le nom de l'annexe à laquelle vous souhaitez faire référence et d'agrandir la céllule en fonction de la langueur de votre réponse, svp."]
[{"$f":"'Questions suppl Rapp FIN'!A374","v":"Pas de questions ou d'autres remarques"}]
["Merci de répondre ici ou de mentionner le nom de l'annexe à laquelle vous souhaitez faire référence et d'agrandir la céllule en fonction de la langueur de votre réponse, svp."]
[{"$f":"'Questions suppl Rapp FIN'!A375","v":"Pas de questions ou d'autres remarques"}]
["Merci de répondre ici ou de mentionner le nom de l'annexe à laquelle vous souhaitez faire référence et d'agrandir la céllule en fonction de la langueur de votre réponse, svp."]
[{"$f":"'Questions suppl Rapp FIN'!A376","v":"Pas de questions ou d'autres remarques"}]
["Merci de répondre ici ou de mentionner le nom de l'annexe à laquelle vous souhaitez faire référence et d'agrandir la céllule en fonction de la langueur de votre réponse, svp."]
[{"$f":"'Questions suppl Rapp FIN'!A377","v":"Pas de questions ou d'autres remarques"}]
["Merci de répondre ici ou de mentionner le nom de l'annexe à laquelle vous souhaitez faire référence et d'agrandir la céllule en fonction de la langueur de votre réponse, svp."]
[{"$f":"'Questions suppl Rapp FIN'!A378","v":"Pas de questions ou d'autres remarques"}]
["Merci de répondre ici ou de mentionner le nom de l'annexe à laquelle vous souhaitez faire référence et d'agrandir la céllule en fonction de la langueur de votre réponse, svp."]
[{"$f":"'Questions suppl Rapp FIN'!A379","v":"Pas de questions ou d'autres remarques"}]
["Merci de répondre ici ou de mentionner le nom de l'annexe à laquelle vous souhaitez faire référence et d'agrandir la céllule en fonction de la langueur de votre réponse, svp."]
[{"$f":"'Questions suppl Rapp FIN'!A380","v":"Pas de questions ou d'autres remarques"}]
["Merci de répondre ici ou de mentionner le nom de l'annexe à laquelle vous souhaitez faire référence et d'agrandir la céllule en fonction de la langueur de votre réponse, svp."]
[{"$f":"'Questions suppl Rapp FIN'!A381","v":"Pas de questions ou d'autres remarques"}]
["Merci de répondre ici ou de mentionner le nom de l'annexe à laquelle vous souhaitez faire référence et d'agrandir la céllule en fonction de la langueur de votre réponse, svp."]
[]
[{"$f":"'Questions suppl Rapp FIN'!A383","v":"Autre : (compléter soi-même) "}]
[]
[{"$f":"'Questions suppl Rapp FIN'!A385","v":"Pas de questions ou d'autres remarques"}]
["Merci de répondre ici ou de mentionner le nom de l'annexe à laquelle vous souhaitez faire référence et d'agrandir la céllule en fonction de la langueur de votre réponse, svp."]
[{"$f":"'Questions suppl Rapp FIN'!A386","v":"Pas de questions ou d'autres remarques"}]
["Merci de répondre ici ou de mentionner le nom de l'annexe à laquelle vous souhaitez faire référence et d'agrandir la céllule en fonction de la langueur de votre réponse, svp."]
[{"$f":"'Questions suppl Rapp FIN'!A387","v":"Pas de questions ou d'autres remarques"}]
["Merci de répondre ici ou de mentionner le nom de l'annexe à laquelle vous souhaitez faire référence et d'agrandir la céllule en fonction de la langueur de votre réponse, svp."]
[{"$f":"'Questions suppl Rapp FIN'!A388","v":"Pas de questions ou d'autres remarques"}]
["Merci de répondre ici ou de mentionner le nom de l'annexe à laquelle vous souhaitez faire référence et d'agrandir la céllule en fonction de la langueur de votre réponse, svp."]
[{"$f":"'Questions suppl Rapp FIN'!A389","v":"Pas de questions ou d'autres remarques"}]
["Merci de répondre ici ou de mentionner le nom de l'annexe à laquelle vous souhaitez faire référence et d'agrandir la céllule en fonction de la langueur de votre réponse, svp."]
[{"$f":"'Questions suppl Rapp FIN'!A390","v":"Pas de questions ou d'autres remarques"}]
["Merci de répondre ici ou de mentionner le nom de l'annexe à laquelle vous souhaitez faire référence et d'agrandir la céllule en fonction de la langueur de votre réponse, svp."]
[{"$f":"'Questions suppl Rapp FIN'!A391","v":"Pas de questions ou d'autres remarques"}]
["Merci de répondre ici ou de mentionner le nom de l'annexe à laquelle vous souhaitez faire référence et d'agrandir la céllule en fonction de la langueur de votre réponse, svp."]
[{"$f":"'Questions suppl Rapp FIN'!A392","v":"Pas de questions ou d'autres remarques"}]
["Merci de répondre ici ou de mentionner le nom de l'annexe à laquelle vous souhaitez faire référence et d'agrandir la céllule en fonction de la langueur de votre réponse, svp."]
[{"$f":"'Questions suppl Rapp FIN'!A393","v":"Pas de questions ou d'autres remarques"}]
["Merci de répondre ici ou de mentionner le nom de l'annexe à laquelle vous souhaitez faire référence et d'agrandir la céllule en fonction de la langueur de votre réponse, svp."]
[{"$f":"'Questions suppl Rapp FIN'!A494","v":"Pas de questions ou d'autres remarques"}]
["Merci de répondre ici ou de mentionner le nom de l'annexe à laquelle vous souhaitez faire référence et d'agrandir la céllule en fonction de la langueur de votre réponse, svp."]
[{"$f":"'Questions suppl Rapp FIN'!A395","v":"Pas de questions ou d'autres remarques"}]
["Merci de répondre ici ou de mentionner le nom de l'annexe à laquelle vous souhaitez faire référence et d'agrandir la céllule en fonction de la langueur de votre réponse, svp."]
[{"$f":"'Questions suppl Rapp FIN'!A396","v":"Pas de questions ou d'autres remarques"}]
["Merci de répondre ici ou de mentionner le nom de l'annexe à laquelle vous souhaitez faire référence et d'agrandir la céllule en fonction de la langueur de votre réponse, svp."]
[{"$f":"'Questions suppl Rapp FIN'!A397","v":"Pas de questions ou d'autres remarques"}]
["Merci de répondre ici ou de mentionner le nom de l'annexe à laquelle vous souhaitez faire référence et d'agrandir la céllule en fonction de la langueur de votre réponse, svp."]
[{"$f":"'Questions suppl Rapp FIN'!A398","v":"Pas de questions ou d'autres remarques"}]
["Merci de répondre ici ou de mentionner le nom de l'annexe à laquelle vous souhaitez faire référence et d'agrandir la céllule en fonction de la langueur de votre réponse, svp."]
[]
["AUTRE FRAIS DE FONCTIONNEMENT DIRECTS"]
[]
[{"$f":"'Questions suppl Rapp FIN'!A402","v":"Choisissez dans la liste Frais de fonctionnement indirects"}]
[]
[{"$f":"'Questions suppl Rapp FIN'!A404","v":"Pas de questions ou d'autres remarques"}]
["Merci de répondre ici ou de mentionner le nom de l'annexe à laquelle vous souhaitez faire référence et d'agrandir la céllule en fonction de la langueur de votre réponse, svp."]
[{"$f":"'Questions suppl Rapp FIN'!A405","v":"Pas de questions ou d'autres remarques"}]
["Merci de répondre ici ou de mentionner le nom de l'annexe à laquelle vous souhaitez faire référence et d'agrandir la céllule en fonction de la langueur de votre réponse, svp."]
[{"$f":"'Questions suppl Rapp FIN'!A406","v":"Pas de questions ou d'autres remarques"}]
["Merci de répondre ici ou de mentionner le nom de l'annexe à laquelle vous souhaitez faire référence et d'agrandir la céllule en fonction de la langueur de votre réponse, svp."]
[{"$f":"'Questions suppl Rapp FIN'!A407","v":"Pas de questions ou d'autres remarques"}]
["Merci de répondre ici ou de mentionner le nom de l'annexe à laquelle vous souhaitez faire référence et d'agrandir la céllule en fonction de la langueur de votre réponse, svp."]
[{"$f":"'Questions suppl Rapp FIN'!A408","v":"Pas de questions ou d'autres remarques"}]
["Merci de répondre ici ou de mentionner le nom de l'annexe à laquelle vous souhaitez faire référence et d'agrandir la céllule en fonction de la langueur de votre réponse, svp."]
[{"$f":"'Questions suppl Rapp FIN'!A409","v":"Pas de questions ou d'autres remarques"}]
["Merci de répondre ici ou de mentionner le nom de l'annexe à laquelle vous souhaitez faire référence et d'agrandir la céllule en fonction de la langueur de votre réponse, svp."]
[{"$f":"'Questions suppl Rapp FIN'!A410","v":"Pas de questions ou d'autres remarques"}]
["Merci de répondre ici ou de mentionner le nom de l'annexe à laquelle vous souhaitez faire référence et d'agrandir la céllule en fonction de la langueur de votre réponse, svp."]
[{"$f":"'Questions suppl Rapp FIN'!A411","v":"Pas de questions ou d'autres remarques"}]
["Merci de répondre ici ou de mentionner le nom de l'annexe à laquelle vous souhaitez faire référence et d'agrandir la céllule en fonction de la langueur de votre réponse, svp."]
[{"$f":"'Questions suppl Rapp FIN'!A412","v":"Pas de questions ou d'autres remarques"}]
["Merci de répondre ici ou de mentionner le nom de l'annexe à laquelle vous souhaitez faire référence et d'agrandir la céllule en fonction de la langueur de votre réponse, svp."]
[{"$f":"'Questions suppl Rapp FIN'!A413","v":"Pas de questions ou d'autres remarques"}]
["Merci de répondre ici ou de mentionner le nom de l'annexe à laquelle vous souhaitez faire référence et d'agrandir la céllule en fonction de la langueur de votre réponse, svp."]
[{"$f":"'Questions suppl Rapp FIN'!A414","v":"Pas de questions ou d'autres remarques"}]
["Merci de répondre ici ou de mentionner le nom de l'annexe à laquelle vous souhaitez faire référence et d'agrandir la céllule en fonction de la langueur de votre réponse, svp."]
[{"$f":"'Questions suppl Rapp FIN'!A415","v":"Pas de questions ou d'autres remarques"}]
["Merci de répondre ici ou de mentionner le nom de l'annexe à laquelle vous souhaitez faire référence et d'agrandir la céllule en fonction de la langueur de votre réponse, svp."]
[{"$f":"'Questions suppl Rapp FIN'!A416","v":"Pas de questions ou d'autres remarques"}]
["Merci de répondre ici ou de mentionner le nom de l'annexe à laquelle vous souhaitez faire référence et d'agrandir la céllule en fonction de la langueur de votre réponse, svp."]
[]
[{"$f":"'Questions suppl Rapp FIN'!A418","v":"Choisissez dans la liste Frais de fonctionnement indirects"}]
[]
[{"$f":"'Questions suppl Rapp FIN'!A420","v":"Pas de questions ou d'autres remarques"}]
["Merci de répondre ici ou de mentionner le nom de l'annexe à laquelle vous souhaitez faire référence et d'agrandir la céllule en fonction de la langueur de votre réponse, svp."]
[{"$f":"'Questions suppl Rapp FIN'!A421","v":"Pas de questions ou d'autres remarques"}]
["Merci de répondre ici ou de mentionner le nom de l'annexe à laquelle vous souhaitez faire référence et d'agrandir la céllule en fonction de la langueur de votre réponse, svp."]
[{"$f":"'Questions suppl Rapp FIN'!A422","v":"Pas de questions ou d'autres remarques"}]
["Merci de répondre ici ou de mentionner le nom de l'annexe à laquelle vous souhaitez faire référence et d'agrandir la céllule en fonction de la langueur de votre réponse, svp."]
[{"$f":"'Questions suppl Rapp FIN'!A423","v":"Pas de questions ou d'autres remarques"}]
["Merci de répondre ici ou de mentionner le nom de l'annexe à laquelle vous souhaitez faire référence et d'agrandir la céllule en fonction de la langueur de votre réponse, svp."]
[{"$f":"'Questions suppl Rapp FIN'!A424","v":"Pas de questions ou d'autres remarques"}]
["Merci de répondre ici ou de mentionner le nom de l'annexe à laquelle vous souhaitez faire référence et d'agrandir la céllule en fonction de la langueur de votre réponse, svp."]
[{"$f":"'Questions suppl Rapp FIN'!A425","v":"Pas de questions ou d'autres remarques"}]
["Merci de répondre ici ou de mentionner le nom de l'annexe à laquelle vous souhaitez faire référence et d'agrandir la céllule en fonction de la langueur de votre réponse, svp."]
[{"$f":"'Questions suppl Rapp FIN'!A426","v":"Pas de questions ou d'autres remarques"}]
["Merci de répondre ici ou de mentionner le nom de l'annexe à laquelle vous souhaitez faire référence et d'agrandir la céllule en fonction de la langueur de votre réponse, svp."]
[{"$f":"'Questions suppl Rapp FIN'!A427","v":"Pas de questions ou d'autres remarques"}]
["Merci de répondre ici ou de mentionner le nom de l'annexe à laquelle vous souhaitez faire référence et d'agrandir la céllule en fonction de la langueur de votre réponse, svp."]
[{"$f":"'Questions suppl Rapp FIN'!A428","v":"Pas de questions ou d'autres remarques"}]
["Merci de répondre ici ou de mentionner le nom de l'annexe à laquelle vous souhaitez faire référence et d'agrandir la céllule en fonction de la langueur de votre réponse, svp."]
[{"$f":"'Questions suppl Rapp FIN'!A429","v":"Pas de questions ou d'autres remarques"}]
["Merci de répondre ici ou de mentionner le nom de l'annexe à laquelle vous souhaitez faire référence et d'agrandir la céllule en fonction de la langueur de votre réponse, svp."]
[{"$f":"'Questions suppl Rapp FIN'!A430","v":"Pas de questions ou d'autres remarques"}]
["Merci de répondre ici ou de mentionner le nom de l'annexe à laquelle vous souhaitez faire référence et d'agrandir la céllule en fonction de la langueur de votre réponse, svp."]
[{"$f":"'Questions suppl Rapp FIN'!A431","v":"Pas de questions ou d'autres remarques"}]
["Merci de répondre ici ou de mentionner le nom de l'annexe à laquelle vous souhaitez faire référence et d'agrandir la céllule en fonction de la langueur de votre réponse, svp."]
[{"$f":"'Questions suppl Rapp FIN'!A432","v":"Pas de questions ou d'autres remarques"}]
["Merci de répondre ici ou de mentionner le nom de l'annexe à laquelle vous souhaitez faire référence et d'agrandir la céllule en fonction de la langueur de votre réponse, svp."]
[]
[{"$f":"'Questions suppl Rapp FIN'!A434","v":"Choisissez dans la liste Frais de fonctionnement indirects"}]
[]
[{"$f":"'Questions suppl Rapp FIN'!A436","v":"Pas de questions ou d'autres remarques"}]
["Merci de répondre ici ou de mentionner le nom de l'annexe à laquelle vous souhaitez faire référence et d'agrandir la céllule en fonction de la langueur de votre réponse, svp."]
[{"$f":"'Questions suppl Rapp FIN'!A437","v":"Pas de questions ou d'autres remarques"}]
["Merci de répondre ici ou de mentionner le nom de l'annexe à laquelle vous souhaitez faire référence et d'agrandir la céllule en fonction de la langueur de votre réponse, svp."]
[{"$f":"'Questions suppl Rapp FIN'!A438","v":"Pas de questions ou d'autres remarques"}]
["Merci de répondre ici ou de mentionner le nom de l'annexe à laquelle vous souhaitez faire référence et d'agrandir la céllule en fonction de la langueur de votre réponse, svp."]
[{"$f":"'Questions suppl Rapp FIN'!A439","v":"Pas de questions ou d'autres remarques"}]
["Merci de répondre ici ou de mentionner le nom de l'annexe à laquelle vous souhaitez faire référence et d'agrandir la céllule en fonction de la langueur de votre réponse, svp."]
[{"$f":"'Questions suppl Rapp FIN'!A440","v":"Pas de questions ou d'autres remarques"}]
["Merci de répondre ici ou de mentionner le nom de l'annexe à laquelle vous souhaitez faire référence et d'agrandir la céllule en fonction de la langueur de votre réponse, svp."]
[{"$f":"'Questions suppl Rapp FIN'!A441","v":"Pas de questions ou d'autres remarques"}]
["Merci de répondre ici ou de mentionner le nom de l'annexe à laquelle vous souhaitez faire référence et d'agrandir la céllule en fonction de la langueur de votre réponse, svp."]
[{"$f":"'Questions suppl Rapp FIN'!A442","v":"Pas de questions ou d'autres remarques"}]
["Merci de répondre ici ou de mentionner le nom de l'annexe à laquelle vous souhaitez faire référence et d'agrandir la céllule en fonction de la langueur de votre réponse, svp."]
[{"$f":"'Questions suppl Rapp FIN'!A443","v":"Pas de questions ou d'autres remarques"}]
["Merci de répondre ici ou de mentionner le nom de l'annexe à laquelle vous souhaitez faire référence et d'agrandir la céllule en fonction de la langueur de votre réponse, svp."]
[{"$f":"'Questions suppl Rapp FIN'!A444","v":"Pas de questions ou d'autres remarques"}]
["Merci de répondre ici ou de mentionner le nom de l'annexe à laquelle vous souhaitez faire référence et d'agrandir la céllule en fonction de la langueur de votre réponse, svp."]
[{"$f":"'Questions suppl Rapp FIN'!A445","v":"Pas de questions ou d'autres remarques"}]
["Merci de répondre ici ou de mentionner le nom de l'annexe à laquelle vous souhaitez faire référence et d'agrandir la céllule en fonction de la langueur de votre réponse, svp."]
[{"$f":"'Questions suppl Rapp FIN'!A446","v":"Pas de questions ou d'autres remarques"}]
["Merci de répondre ici ou de mentionner le nom de l'annexe à laquelle vous souhaitez faire référence et d'agrandir la céllule en fonction de la langueur de votre réponse, svp."]
[{"$f":"'Questions suppl Rapp FIN'!A447","v":"Pas de questions ou d'autres remarques"}]
["Merci de répondre ici ou de mentionner le nom de l'annexe à laquelle vous souhaitez faire référence et d'agrandir la céllule en fonction de la langueur de votre réponse, svp."]
[{"$f":"'Questions suppl Rapp FIN'!A448","v":"Pas de questions ou d'autres remarques"}]
["Merci de répondre ici ou de mentionner le nom de l'annexe à laquelle vous souhaitez faire référence et d'agrandir la céllule en fonction de la langueur de votre réponse, svp."]
[]
[{"$f":"'Questions suppl Rapp FIN'!A450","v":"Choisissez dans la liste Frais de fonctionnement indirects"}]
[]
[{"$f":"'Questions suppl Rapp FIN'!A452","v":"Pas de questions ou d'autres remarques"}]
["Merci de répondre ici ou de mentionner le nom de l'annexe à laquelle vous souhaitez faire référence et d'agrandir la céllule en fonction de la langueur de votre réponse, svp."]
[{"$f":"'Questions suppl Rapp FIN'!A453","v":"Pas de questions ou d'autres remarques"}]
["Merci de répondre ici ou de mentionner le nom de l'annexe à laquelle vous souhaitez faire référence et d'agrandir la céllule en fonction de la langueur de votre réponse, svp."]
[{"$f":"'Questions suppl Rapp FIN'!A454","v":"Pas de questions ou d'autres remarques"}]
["Merci de répondre ici ou de mentionner le nom de l'annexe à laquelle vous souhaitez faire référence et d'agrandir la céllule en fonction de la langueur de votre réponse, svp."]
[{"$f":"'Questions suppl Rapp FIN'!A455","v":"Pas de questions ou d'autres remarques"}]
["Merci de répondre ici ou de mentionner le nom de l'annexe à laquelle vous souhaitez faire référence et d'agrandir la céllule en fonction de la langueur de votre réponse, svp."]
[{"$f":"'Questions suppl Rapp FIN'!A456","v":"Pas de questions ou d'autres remarques"}]
["Merci de répondre ici ou de mentionner le nom de l'annexe à laquelle vous souhaitez faire référence et d'agrandir la céllule en fonction de la langueur de votre réponse, svp."]
[{"$f":"'Questions suppl Rapp FIN'!A457","v":"Pas de questions ou d'autres remarques"}]
["Merci de répondre ici ou de mentionner le nom de l'annexe à laquelle vous souhaitez faire référence et d'agrandir la céllule en fonction de la langueur de votre réponse, svp."]
[{"$f":"'Questions suppl Rapp FIN'!A458","v":"Pas de questions ou d'autres remarques"}]
["Merci de répondre ici ou de mentionner le nom de l'annexe à laquelle vous souhaitez faire référence et d'agrandir la céllule en fonction de la langueur de votre réponse, svp."]
[{"$f":"'Questions suppl Rapp FIN'!A459","v":"Pas de questions ou d'autres remarques"}]
["Merci de répondre ici ou de mentionner le nom de l'annexe à laquelle vous souhaitez faire référence et d'agrandir la céllule en fonction de la langueur de votre réponse, svp."]
[{"$f":"'Questions suppl Rapp FIN'!A460","v":"Pas de questions ou d'autres remarques"}]
["Merci de répondre ici ou de mentionner le nom de l'annexe à laquelle vous souhaitez faire référence et d'agrandir la céllule en fonction de la langueur de votre réponse, svp."]
[{"$f":"'Questions suppl Rapp FIN'!A461","v":"Pas de questions ou d'autres remarques"}]
["Merci de répondre ici ou de mentionner le nom de l'annexe à laquelle vous souhaitez faire référence et d'agrandir la céllule en fonction de la langueur de votre réponse, svp."]
[{"$f":"'Questions suppl Rapp FIN'!A462","v":"Pas de questions ou d'autres remarques"}]
["Merci de répondre ici ou de mentionner le nom de l'annexe à laquelle vous souhaitez faire référence et d'agrandir la céllule en fonction de la langueur de votre réponse, svp."]
[{"$f":"'Questions suppl Rapp FIN'!A463","v":"Pas de questions ou d'autres remarques"}]
["Merci de répondre ici ou de mentionner le nom de l'annexe à laquelle vous souhaitez faire référence et d'agrandir la céllule en fonction de la langueur de votre réponse, svp."]
[{"$f":"'Questions suppl Rapp FIN'!A464","v":"Pas de questions ou d'autres remarques"}]
["Merci de répondre ici ou de mentionner le nom de l'annexe à laquelle vous souhaitez faire référence et d'agrandir la céllule en fonction de la langueur de votre réponse, svp."]
[]
[{"$f":"'Questions suppl Rapp FIN'!A466","v":"Choisissez dans la liste Frais de fonctionnement indirects"}]
[]
[{"$f":"'Questions suppl Rapp FIN'!A468","v":"Pas de questions ou d'autres remarques"}]
["Merci de répondre ici ou de mentionner le nom de l'annexe à laquelle vous souhaitez faire référence et d'agrandir la céllule en fonction de la langueur de votre réponse, svp."]
[{"$f":"'Questions suppl Rapp FIN'!A469","v":"Pas de questions ou d'autres remarques"}]
["Merci de répondre ici ou de mentionner le nom de l'annexe à laquelle vous souhaitez faire référence et d'agrandir la céllule en fonction de la langueur de votre réponse, svp."]
[{"$f":"'Questions suppl Rapp FIN'!A470","v":"Pas de questions ou d'autres remarques"}]
["Merci de répondre ici ou de mentionner le nom de l'annexe à laquelle vous souhaitez faire référence et d'agrandir la céllule en fonction de la langueur de votre réponse, svp."]
[{"$f":"'Questions suppl Rapp FIN'!A471","v":"Pas de questions ou d'autres remarques"}]
["Merci de répondre ici ou de mentionner le nom de l'annexe à laquelle vous souhaitez faire référence et d'agrandir la céllule en fonction de la langueur de votre réponse, svp."]
[{"$f":"'Questions suppl Rapp FIN'!A472","v":"Pas de questions ou d'autres remarques"}]
["Merci de répondre ici ou de mentionner le nom de l'annexe à laquelle vous souhaitez faire référence et d'agrandir la céllule en fonction de la langueur de votre réponse, svp."]
[{"$f":"'Questions suppl Rapp FIN'!A473","v":"Pas de questions ou d'autres remarques"}]
["Merci de répondre ici ou de mentionner le nom de l'annexe à laquelle vous souhaitez faire référence et d'agrandir la céllule en fonction de la langueur de votre réponse, svp."]
[{"$f":"'Questions suppl Rapp FIN'!A474","v":"Pas de questions ou d'autres remarques"}]
["Merci de répondre ici ou de mentionner le nom de l'annexe à laquelle vous souhaitez faire référence et d'agrandir la céllule en fonction de la langueur de votre réponse, svp."]
[{"$f":"'Questions suppl Rapp FIN'!A475","v":"Pas de questions ou d'autres remarques"}]
["Merci de répondre ici ou de mentionner le nom de l'annexe à laquelle vous souhaitez faire référence et d'agrandir la céllule en fonction de la langueur de votre réponse, svp."]
[{"$f":"'Questions suppl Rapp FIN'!A476","v":"Pas de questions ou d'autres remarques"}]
["Merci de répondre ici ou de mentionner le nom de l'annexe à laquelle vous souhaitez faire référence et d'agrandir la céllule en fonction de la langueur de votre réponse, svp."]
[{"$f":"'Questions suppl Rapp FIN'!A477","v":"Pas de questions ou d'autres remarques"}]
["Merci de répondre ici ou de mentionner le nom de l'annexe à laquelle vous souhaitez faire référence et d'agrandir la céllule en fonction de la langueur de votre réponse, svp."]
[{"$f":"'Questions suppl Rapp FIN'!A478","v":"Pas de questions ou d'autres remarques"}]
["Merci de répondre ici ou de mentionner le nom de l'annexe à laquelle vous souhaitez faire référence et d'agrandir la céllule en fonction de la langueur de votre réponse, svp."]
[{"$f":"'Questions suppl Rapp FIN'!A479","v":"Pas de questions ou d'autres remarques"}]
["Merci de répondre ici ou de mentionner le nom de l'annexe à laquelle vous souhaitez faire référence et d'agrandir la céllule en fonction de la langueur de votre réponse, svp."]
[{"$f":"'Questions suppl Rapp FIN'!A480","v":"Pas de questions ou d'autres remarques"}]
["Merci de répondre ici ou de mentionner le nom de l'annexe à laquelle vous souhaitez faire référence et d'agrandir la céllule en fonction de la langueur de votre réponse, svp."]
[]
[{"$f":"'Questions suppl Rapp FIN'!A482","v":"Choisissez dans la liste Frais de fonctionnement indirects"}]
[]
[{"$f":"'Questions suppl Rapp FIN'!A484","v":"Pas de questions ou d'autres remarques"}]
["Merci de répondre ici ou de mentionner le nom de l'annexe à laquelle vous souhaitez faire référence et d'agrandir la céllule en fonction de la langueur de votre réponse, svp."]
[{"$f":"'Questions suppl Rapp FIN'!A485","v":"Pas de questions ou d'autres remarques"}]
["Merci de répondre ici ou de mentionner le nom de l'annexe à laquelle vous souhaitez faire référence et d'agrandir la céllule en fonction de la langueur de votre réponse, svp."]
[{"$f":"'Questions suppl Rapp FIN'!A486","v":"Pas de questions ou d'autres remarques"}]
["Merci de répondre ici ou de mentionner le nom de l'annexe à laquelle vous souhaitez faire référence et d'agrandir la céllule en fonction de la langueur de votre réponse, svp."]
[{"$f":"'Questions suppl Rapp FIN'!A487","v":"Pas de questions ou d'autres remarques"}]
["Merci de répondre ici ou de mentionner le nom de l'annexe à laquelle vous souhaitez faire référence et d'agrandir la céllule en fonction de la langueur de votre réponse, svp."]
[{"$f":"'Questions suppl Rapp FIN'!A488","v":"Pas de questions ou d'autres remarques"}]
["Merci de répondre ici ou de mentionner le nom de l'annexe à laquelle vous souhaitez faire référence et d'agrandir la céllule en fonction de la langueur de votre réponse, svp."]
[{"$f":"'Questions suppl Rapp FIN'!A489","v":"Pas de questions ou d'autres remarques"}]
["Merci de répondre ici ou de mentionner le nom de l'annexe à laquelle vous souhaitez faire référence et d'agrandir la céllule en fonction de la langueur de votre réponse, svp."]
[{"$f":"'Questions suppl Rapp FIN'!A490","v":"Pas de questions ou d'autres remarques"}]
["Merci de répondre ici ou de mentionner le nom de l'annexe à laquelle vous souhaitez faire référence et d'agrandir la céllule en fonction de la langueur de votre réponse, svp."]
[{"$f":"'Questions suppl Rapp FIN'!A491","v":"Pas de questions ou d'autres remarques"}]
["Merci de répondre ici ou de mentionner le nom de l'annexe à laquelle vous souhaitez faire référence et d'agrandir la céllule en fonction de la langueur de votre réponse, svp."]
[{"$f":"'Questions suppl Rapp FIN'!A492","v":"Pas de questions ou d'autres remarques"}]
["Merci de répondre ici ou de mentionner le nom de l'annexe à laquelle vous souhaitez faire référence et d'agrandir la céllule en fonction de la langueur de votre réponse, svp."]
[{"$f":"'Questions suppl Rapp FIN'!A493","v":"Pas de questions ou d'autres remarques"}]
["Merci de répondre ici ou de mentionner le nom de l'annexe à laquelle vous souhaitez faire référence et d'agrandir la céllule en fonction de la langueur de votre réponse, svp."]
[{"$f":"'Questions suppl Rapp FIN'!A494","v":"Pas de questions ou d'autres remarques"}]
["Merci de répondre ici ou de mentionner le nom de l'annexe à laquelle vous souhaitez faire référence et d'agrandir la céllule en fonction de la langueur de votre réponse, svp."]
[{"$f":"'Questions suppl Rapp FIN'!A495","v":"Pas de questions ou d'autres remarques"}]
["Merci de répondre ici ou de mentionner le nom de l'annexe à laquelle vous souhaitez faire référence et d'agrandir la céllule en fonction de la langueur de votre réponse, svp."]
[{"$f":"'Questions suppl Rapp FIN'!A496","v":"Pas de questions ou d'autres remarques"}]
["Merci de répondre ici ou de mentionner le nom de l'annexe à laquelle vous souhaitez faire référence et d'agrandir la céllule en fonction de la langueur de votre réponse, svp."]
[]
[{"$f":"'Questions suppl Rapp FIN'!A498","v":"Choisissez dans la liste Frais de fonctionnement indirects"}]
[]
[{"$f":"'Questions suppl Rapp FIN'!A500","v":"Pas de questions ou d'autres remarques"}]
["Merci de répondre ici ou de mentionner le nom de l'annexe à laquelle vous souhaitez faire référence et d'agrandir la céllule en fonction de la langueur de votre réponse, svp."]
[{"$f":"'Questions suppl Rapp FIN'!A501","v":"Pas de questions ou d'autres remarques"}]
["Merci de répondre ici ou de mentionner le nom de l'annexe à laquelle vous souhaitez faire référence et d'agrandir la céllule en fonction de la langueur de votre réponse, svp."]
[{"$f":"'Questions suppl Rapp FIN'!A502","v":"Pas de questions ou d'autres remarques"}]
["Merci de répondre ici ou de mentionner le nom de l'annexe à laquelle vous souhaitez faire référence et d'agrandir la céllule en fonction de la langueur de votre réponse, svp."]
[{"$f":"'Questions suppl Rapp FIN'!A503","v":"Pas de questions ou d'autres remarques"}]
["Merci de répondre ici ou de mentionner le nom de l'annexe à laquelle vous souhaitez faire référence et d'agrandir la céllule en fonction de la langueur de votre réponse, svp."]
[{"$f":"'Questions suppl Rapp FIN'!A504","v":"Pas de questions ou d'autres remarques"}]
["Merci de répondre ici ou de mentionner le nom de l'annexe à laquelle vous souhaitez faire référence et d'agrandir la céllule en fonction de la langueur de votre réponse, svp."]
[{"$f":"'Questions suppl Rapp FIN'!A505","v":"Pas de questions ou d'autres remarques"}]
["Merci de répondre ici ou de mentionner le nom de l'annexe à laquelle vous souhaitez faire référence et d'agrandir la céllule en fonction de la langueur de votre réponse, svp."]
[{"$f":"'Questions suppl Rapp FIN'!A506","v":"Pas de questions ou d'autres remarques"}]
["Merci de répondre ici ou de mentionner le nom de l'annexe à laquelle vous souhaitez faire référence et d'agrandir la céllule en fonction de la langueur de votre réponse, svp."]
[{"$f":"'Questions suppl Rapp FIN'!A507","v":"Pas de questions ou d'autres remarques"}]
["Merci de répondre ici ou de mentionner le nom de l'annexe à laquelle vous souhaitez faire référence et d'agrandir la céllule en fonction de la langueur de votre réponse, svp."]
[{"$f":"'Questions suppl Rapp FIN'!A508","v":"Pas de questions ou d'autres remarques"}]
["Merci de répondre ici ou de mentionner le nom de l'annexe à laquelle vous souhaitez faire référence et d'agrandir la céllule en fonction de la langueur de votre réponse, svp."]
[{"$f":"'Questions suppl Rapp FIN'!A509","v":"Pas de questions ou d'autres remarques"}]
["Merci de répondre ici ou de mentionner le nom de l'annexe à laquelle vous souhaitez faire référence et d'agrandir la céllule en fonction de la langueur de votre réponse, svp."]
[{"$f":"'Questions suppl Rapp FIN'!A510","v":"Pas de questions ou d'autres remarques"}]
["Merci de répondre ici ou de mentionner le nom de l'annexe à laquelle vous souhaitez faire référence et d'agrandir la céllule en fonction de la langueur de votre réponse, svp."]
[{"$f":"'Questions suppl Rapp FIN'!A511","v":"Pas de questions ou d'autres remarques"}]
["Merci de répondre ici ou de mentionner le nom de l'annexe à laquelle vous souhaitez faire référence et d'agrandir la céllule en fonction de la langueur de votre réponse, svp."]
[{"$f":"'Questions suppl Rapp FIN'!A512","v":"Pas de questions ou d'autres remarques"}]
["Merci de répondre ici ou de mentionner le nom de l'annexe à laquelle vous souhaitez faire référence et d'agrandir la céllule en fonction de la langueur de votre réponse, svp."]
[]
[{"$f":"'Questions suppl Rapp FIN'!A514","v":"Choisissez dans la liste Frais de fonctionnement indirects"}]
[]
[{"$f":"'Questions suppl Rapp FIN'!A516","v":"Pas de questions ou d'autres remarques"}]
["Merci de répondre ici ou de mentionner le nom de l'annexe à laquelle vous souhaitez faire référence et d'agrandir la céllule en fonction de la langueur de votre réponse, svp."]
[{"$f":"'Questions suppl Rapp FIN'!A517","v":"Pas de questions ou d'autres remarques"}]
["Merci de répondre ici ou de mentionner le nom de l'annexe à laquelle vous souhaitez faire référence et d'agrandir la céllule en fonction de la langueur de votre réponse, svp."]
[{"$f":"'Questions suppl Rapp FIN'!A518","v":"Pas de questions ou d'autres remarques"}]
["Merci de répondre ici ou de mentionner le nom de l'annexe à laquelle vous souhaitez faire référence et d'agrandir la céllule en fonction de la langueur de votre réponse, svp."]
[{"$f":"'Questions suppl Rapp FIN'!A519","v":"Pas de questions ou d'autres remarques"}]
["Merci de répondre ici ou de mentionner le nom de l'annexe à laquelle vous souhaitez faire référence et d'agrandir la céllule en fonction de la langueur de votre réponse, svp."]
[{"$f":"'Questions suppl Rapp FIN'!A520","v":"Pas de questions ou d'autres remarques"}]
["Merci de répondre ici ou de mentionner le nom de l'annexe à laquelle vous souhaitez faire référence et d'agrandir la céllule en fonction de la langueur de votre réponse, svp."]
[{"$f":"'Questions suppl Rapp FIN'!A521","v":"Pas de questions ou d'autres remarques"}]
["Merci de répondre ici ou de mentionner le nom de l'annexe à laquelle vous souhaitez faire référence et d'agrandir la céllule en fonction de la langueur de votre réponse, svp."]
[{"$f":"'Questions suppl Rapp FIN'!A522","v":"Pas de questions ou d'autres remarques"}]
["Merci de répondre ici ou de mentionner le nom de l'annexe à laquelle vous souhaitez faire référence et d'agrandir la céllule en fonction de la langueur de votre réponse, svp."]
[{"$f":"'Questions suppl Rapp FIN'!A523","v":"Pas de questions ou d'autres remarques"}]
["Merci de répondre ici ou de mentionner le nom de l'annexe à laquelle vous souhaitez faire référence et d'agrandir la céllule en fonction de la langueur de votre réponse, svp."]
[{"$f":"'Questions suppl Rapp FIN'!A524","v":"Pas de questions ou d'autres remarques"}]
["Merci de répondre ici ou de mentionner le nom de l'annexe à laquelle vous souhaitez faire référence et d'agrandir la céllule en fonction de la langueur de votre réponse, svp."]
[{"$f":"'Questions suppl Rapp FIN'!A525","v":"Pas de questions ou d'autres remarques"}]
["Merci de répondre ici ou de mentionner le nom de l'annexe à laquelle vous souhaitez faire référence et d'agrandir la céllule en fonction de la langueur de votre réponse, svp."]
[{"$f":"'Questions suppl Rapp FIN'!A526","v":"Pas de questions ou d'autres remarques"}]
["Merci de répondre ici ou de mentionner le nom de l'annexe à laquelle vous souhaitez faire référence et d'agrandir la céllule en fonction de la langueur de votre réponse, svp."]
[{"$f":"'Questions suppl Rapp FIN'!A527","v":"Pas de questions ou d'autres remarques"}]
["Merci de répondre ici ou de mentionner le nom de l'annexe à laquelle vous souhaitez faire référence et d'agrandir la céllule en fonction de la langueur de votre réponse, svp."]
[{"$f":"'Questions suppl Rapp FIN'!A528","v":"Pas de questions ou d'autres remarques"}]
["Merci de répondre ici ou de mentionner le nom de l'annexe à laquelle vous souhaitez faire référence et d'agrandir la céllule en fonction de la langueur de votre réponse, svp."]
[]
[{"$f":"'Questions suppl Rapp FIN'!A530","v":"Choisissez dans la liste Frais de fonctionnement indirects"}]
[]
[{"$f":"'Questions suppl Rapp FIN'!A532","v":"Pas de questions ou d'autres remarques"}]
["Merci de répondre ici ou de mentionner le nom de l'annexe à laquelle vous souhaitez faire référence et d'agrandir la céllule en fonction de la langueur de votre réponse, svp."]
[{"$f":"'Questions suppl Rapp FIN'!A533","v":"Pas de questions ou d'autres remarques"}]
["Merci de répondre ici ou de mentionner le nom de l'annexe à laquelle vous souhaitez faire référence et d'agrandir la céllule en fonction de la langueur de votre réponse, svp."]
[{"$f":"'Questions suppl Rapp FIN'!A534","v":"Pas de questions ou d'autres remarques"}]
["Merci de répondre ici ou de mentionner le nom de l'annexe à laquelle vous souhaitez faire référence et d'agrandir la céllule en fonction de la langueur de votre réponse, svp."]
[{"$f":"'Questions suppl Rapp FIN'!A535","v":"Pas de questions ou d'autres remarques"}]
["Merci de répondre ici ou de mentionner le nom de l'annexe à laquelle vous souhaitez faire référence et d'agrandir la céllule en fonction de la langueur de votre réponse, svp."]
[{"$f":"'Questions suppl Rapp FIN'!A536","v":"Pas de questions ou d'autres remarques"}]
["Merci de répondre ici ou de mentionner le nom de l'annexe à laquelle vous souhaitez faire référence et d'agrandir la céllule en fonction de la langueur de votre réponse, svp."]
[{"$f":"'Questions suppl Rapp FIN'!A537","v":"Pas de questions ou d'autres remarques"}]
["Merci de répondre ici ou de mentionner le nom de l'annexe à laquelle vous souhaitez faire référence et d'agrandir la céllule en fonction de la langueur de votre réponse, svp."]
[{"$f":"'Questions suppl Rapp FIN'!A538","v":"Pas de questions ou d'autres remarques"}]
["Merci de répondre ici ou de mentionner le nom de l'annexe à laquelle vous souhaitez faire référence et d'agrandir la céllule en fonction de la langueur de votre réponse, svp."]
[{"$f":"'Questions suppl Rapp FIN'!A539","v":"Pas de questions ou d'autres remarques"}]
["Merci de répondre ici ou de mentionner le nom de l'annexe à laquelle vous souhaitez faire référence et d'agrandir la céllule en fonction de la langueur de votre réponse, svp."]
[{"$f":"'Questions suppl Rapp FIN'!A540","v":"Pas de questions ou d'autres remarques"}]
["Merci de répondre ici ou de mentionner le nom de l'annexe à laquelle vous souhaitez faire référence et d'agrandir la céllule en fonction de la langueur de votre réponse, svp."]
[{"$f":"'Questions suppl Rapp FIN'!A541","v":"Pas de questions ou d'autres remarques"}]
["Merci de répondre ici ou de mentionner le nom de l'annexe à laquelle vous souhaitez faire référence et d'agrandir la céllule en fonction de la langueur de votre réponse, svp."]
[{"$f":"'Questions suppl Rapp FIN'!A542","v":"Pas de questions ou d'autres remarques"}]
["Merci de répondre ici ou de mentionner le nom de l'annexe à laquelle vous souhaitez faire référence et d'agrandir la céllule en fonction de la langueur de votre réponse, svp."]
[{"$f":"'Questions suppl Rapp FIN'!A543","v":"Pas de questions ou d'autres remarques"}]
["Merci de répondre ici ou de mentionner le nom de l'annexe à laquelle vous souhaitez faire référence et d'agrandir la céllule en fonction de la langueur de votre réponse, svp."]
[{"$f":"'Questions suppl Rapp FIN'!A544","v":"Pas de questions ou d'autres remarques"}]
["Merci de répondre ici ou de mentionner le nom de l'annexe à laquelle vous souhaitez faire référence et d'agrandir la céllule en fonction de la langueur de votre réponse, svp."]
[]
[{"$f":"'Questions suppl Rapp FIN'!A546","v":"Choisissez dans la liste Frais de fonctionnement indirects"}]
[]
[{"$f":"'Questions suppl Rapp FIN'!A548","v":"Pas de questions ou d'autres remarques"}]
["Merci de répondre ici ou de mentionner le nom de l'annexe à laquelle vous souhaitez faire référence et d'agrandir la céllule en fonction de la langueur de votre réponse, svp."]
[{"$f":"'Questions suppl Rapp FIN'!A549","v":"Pas de questions ou d'autres remarques"}]
["Merci de répondre ici ou de mentionner le nom de l'annexe à laquelle vous souhaitez faire référence et d'agrandir la céllule en fonction de la langueur de votre réponse, svp."]
[{"$f":"'Questions suppl Rapp FIN'!A550","v":"Pas de questions ou d'autres remarques"}]
["Merci de répondre ici ou de mentionner le nom de l'annexe à laquelle vous souhaitez faire référence et d'agrandir la céllule en fonction de la langueur de votre réponse, svp."]
[{"$f":"'Questions suppl Rapp FIN'!A551","v":"Pas de questions ou d'autres remarques"}]
["Merci de répondre ici ou de mentionner le nom de l'annexe à laquelle vous souhaitez faire référence et d'agrandir la céllule en fonction de la langueur de votre réponse, svp."]
[{"$f":"'Questions suppl Rapp FIN'!A552","v":"Pas de questions ou d'autres remarques"}]
["Merci de répondre ici ou de mentionner le nom de l'annexe à laquelle vous souhaitez faire référence et d'agrandir la céllule en fonction de la langueur de votre réponse, svp."]
[{"$f":"'Questions suppl Rapp FIN'!A553","v":"Pas de questions ou d'autres remarques"}]
["Merci de répondre ici ou de mentionner le nom de l'annexe à laquelle vous souhaitez faire référence et d'agrandir la céllule en fonction de la langueur de votre réponse, svp."]
[{"$f":"'Questions suppl Rapp FIN'!A554","v":"Pas de questions ou d'autres remarques"}]
["Merci de répondre ici ou de mentionner le nom de l'annexe à laquelle vous souhaitez faire référence et d'agrandir la céllule en fonction de la langueur de votre réponse, svp."]
[{"$f":"'Questions suppl Rapp FIN'!A555","v":"Pas de questions ou d'autres remarques"}]
["Merci de répondre ici ou de mentionner le nom de l'annexe à laquelle vous souhaitez faire référence et d'agrandir la céllule en fonction de la langueur de votre réponse, svp."]
[{"$f":"'Questions suppl Rapp FIN'!A556","v":"Pas de questions ou d'autres remarques"}]
["Merci de répondre ici ou de mentionner le nom de l'annexe à laquelle vous souhaitez faire référence et d'agrandir la céllule en fonction de la langueur de votre réponse, svp."]
[{"$f":"'Questions suppl Rapp FIN'!A557","v":"Pas de questions ou d'autres remarques"}]
["Merci de répondre ici ou de mentionner le nom de l'annexe à laquelle vous souhaitez faire référence et d'agrandir la céllule en fonction de la langueur de votre réponse, svp."]
[{"$f":"'Questions suppl Rapp FIN'!A558","v":"Pas de questions ou d'autres remarques"}]
["Merci de répondre ici ou de mentionner le nom de l'annexe à laquelle vous souhaitez faire référence et d'agrandir la céllule en fonction de la langueur de votre réponse, svp."]
[{"$f":"'Questions suppl Rapp FIN'!A559","v":"Pas de questions ou d'autres remarques"}]
["Merci de répondre ici ou de mentionner le nom de l'annexe à laquelle vous souhaitez faire référence et d'agrandir la céllule en fonction de la langueur de votre réponse, svp."]
[{"$f":"'Questions suppl Rapp FIN'!A560","v":"Pas de questions ou d'autres remarques"}]
["Merci de répondre ici ou de mentionner le nom de l'annexe à laquelle vous souhaitez faire référence et d'agrandir la céllule en fonction de la langueur de votre réponse, svp."]
[]
[{"$f":"'Questions suppl Rapp FIN'!A562","v":"Autre : (compléter soi-même)"}]
[]
[{"$f":"'Questions suppl Rapp FIN'!A564","v":"Pas de questions ou d'autres remarques"}]
["Merci de répondre ici ou de mentionner le nom de l'annexe à laquelle vous souhaitez faire référence et d'agrandir la céllule en fonction de la langueur de votre réponse, svp."]
[{"$f":"'Questions suppl Rapp FIN'!A565","v":"Pas de questions ou d'autres remarques"}]
["Merci de répondre ici ou de mentionner le nom de l'annexe à laquelle vous souhaitez faire référence et d'agrandir la céllule en fonction de la langueur de votre réponse, svp."]
[{"$f":"'Questions suppl Rapp FIN'!A566","v":"Pas de questions ou d'autres remarques"}]
["Merci de répondre ici ou de mentionner le nom de l'annexe à laquelle vous souhaitez faire référence et d'agrandir la céllule en fonction de la langueur de votre réponse, svp."]
[{"$f":"'Questions suppl Rapp FIN'!A567","v":"Pas de questions ou d'autres remarques"}]
["Merci de répondre ici ou de mentionner le nom de l'annexe à laquelle vous souhaitez faire référence et d'agrandir la céllule en fonction de la langueur de votre réponse, svp."]
[{"$f":"'Questions suppl Rapp FIN'!A568","v":"Pas de questions ou d'autres remarques"}]
["Merci de répondre ici ou de mentionner le nom de l'annexe à laquelle vous souhaitez faire référence et d'agrandir la céllule en fonction de la langueur de votre réponse, svp."]
[{"$f":"'Questions suppl Rapp FIN'!A569","v":"Pas de questions ou d'autres remarques"}]
["Merci de répondre ici ou de mentionner le nom de l'annexe à laquelle vous souhaitez faire référence et d'agrandir la céllule en fonction de la langueur de votre réponse, svp."]
[{"$f":"'Questions suppl Rapp FIN'!A570","v":"Pas de questions ou d'autres remarques"}]
["Merci de répondre ici ou de mentionner le nom de l'annexe à laquelle vous souhaitez faire référence et d'agrandir la céllule en fonction de la langueur de votre réponse, svp."]
[{"$f":"'Questions suppl Rapp FIN'!A571","v":"Pas de questions ou d'autres remarques"}]
["Merci de répondre ici ou de mentionner le nom de l'annexe à laquelle vous souhaitez faire référence et d'agrandir la céllule en fonction de la langueur de votre réponse, svp."]
[{"$f":"'Questions suppl Rapp FIN'!A572","v":"Pas de questions ou d'autres remarques"}]
["Merci de répondre ici ou de mentionner le nom de l'annexe à laquelle vous souhaitez faire référence et d'agrandir la céllule en fonction de la langueur de votre réponse, svp."]
[{"$f":"'Questions suppl Rapp FIN'!A573","v":"Pas de questions ou d'autres remarques"}]
["Merci de répondre ici ou de mentionner le nom de l'annexe à laquelle vous souhaitez faire référence et d'agrandir la céllule en fonction de la langueur de votre réponse, svp."]
[{"$f":"'Questions suppl Rapp FIN'!A574","v":"Pas de questions ou d'autres remarques"}]
["Merci de répondre ici ou de mentionner le nom de l'annexe à laquelle vous souhaitez faire référence et d'agrandir la céllule en fonction de la langueur de votre réponse, svp."]
[{"$f":"'Questions suppl Rapp FIN'!A575","v":"Pas de questions ou d'autres remarques"}]
["Merci de répondre ici ou de mentionner le nom de l'annexe à laquelle vous souhaitez faire référence et d'agrandir la céllule en fonction de la langueur de votre réponse, svp."]
[{"$f":"'Questions suppl Rapp FIN'!A576","v":"Pas de questions ou d'autres remarques"}]
["Merci de répondre ici ou de mentionner le nom de l'annexe à laquelle vous souhaitez faire référence et d'agrandir la céllule en fonction de la langueur de votre réponse, svp."]
[]
[{"$f":"'Questions suppl Rapp FIN'!A578","v":"Autre : (compléter soi-même)"}]
[]
[{"$f":"'Questions suppl Rapp FIN'!A580","v":"Pas de questions ou d'autres remarques"}]
["Merci de répondre ici ou de mentionner le nom de l'annexe à laquelle vous souhaitez faire référence et d'agrandir la céllule en fonction de la langueur de votre réponse, svp."]
[{"$f":"'Questions suppl Rapp FIN'!A581","v":"Pas de questions ou d'autres remarques"}]
["Merci de répondre ici ou de mentionner le nom de l'annexe à laquelle vous souhaitez faire référence et d'agrandir la céllule en fonction de la langueur de votre réponse, svp."]
[{"$f":"'Questions suppl Rapp FIN'!A582","v":"Pas de questions ou d'autres remarques"}]
["Merci de répondre ici ou de mentionner le nom de l'annexe à laquelle vous souhaitez faire référence et d'agrandir la céllule en fonction de la langueur de votre réponse, svp."]
[{"$f":"'Questions suppl Rapp FIN'!A583","v":"Pas de questions ou d'autres remarques"}]
["Merci de répondre ici ou de mentionner le nom de l'annexe à laquelle vous souhaitez faire référence et d'agrandir la céllule en fonction de la langueur de votre réponse, svp."]
[{"$f":"'Questions suppl Rapp FIN'!A584","v":"Pas de questions ou d'autres remarques"}]
["Merci de répondre ici ou de mentionner le nom de l'annexe à laquelle vous souhaitez faire référence et d'agrandir la céllule en fonction de la langueur de votre réponse, svp."]
[{"$f":"'Questions suppl Rapp FIN'!A585","v":"Pas de questions ou d'autres remarques"}]
["Merci de répondre ici ou de mentionner le nom de l'annexe à laquelle vous souhaitez faire référence et d'agrandir la céllule en fonction de la langueur de votre réponse, svp."]
[{"$f":"'Questions suppl Rapp FIN'!A586","v":"Pas de questions ou d'autres remarques"}]
["Merci de répondre ici ou de mentionner le nom de l'annexe à laquelle vous souhaitez faire référence et d'agrandir la céllule en fonction de la langueur de votre réponse, svp."]
[{"$f":"'Questions suppl Rapp FIN'!A587","v":"Pas de questions ou d'autres remarques"}]
["Merci de répondre ici ou de mentionner le nom de l'annexe à laquelle vous souhaitez faire référence et d'agrandir la céllule en fonction de la langueur de votre réponse, svp."]
[{"$f":"'Questions suppl Rapp FIN'!A588","v":"Pas de questions ou d'autres remarques"}]
["Merci de répondre ici ou de mentionner le nom de l'annexe à laquelle vous souhaitez faire référence et d'agrandir la céllule en fonction de la langueur de votre réponse, svp."]
[{"$f":"'Questions suppl Rapp FIN'!A589","v":"Pas de questions ou d'autres remarques"}]
["Merci de répondre ici ou de mentionner le nom de l'annexe à laquelle vous souhaitez faire référence et d'agrandir la céllule en fonction de la langueur de votre réponse, svp."]
[{"$f":"'Questions suppl Rapp FIN'!A590","v":"Pas de questions ou d'autres remarques"}]
["Merci de répondre ici ou de mentionner le nom de l'annexe à laquelle vous souhaitez faire référence et d'agrandir la céllule en fonction de la langueur de votre réponse, svp."]
[{"$f":"'Questions suppl Rapp FIN'!A591","v":"Pas de questions ou d'autres remarques"}]
["Merci de répondre ici ou de mentionner le nom de l'annexe à laquelle vous souhaitez faire référence et d'agrandir la céllule en fonction de la langueur de votre réponse, svp."]
[{"$f":"'Questions suppl Rapp FIN'!A592","v":"Pas de questions ou d'autres remarques"}]
["Merci de répondre ici ou de mentionner le nom de l'annexe à laquelle vous souhaitez faire référence et d'agrandir la céllule en fonction de la langueur de votre réponse, svp."]
[{"$f":"'Questions suppl Rapp FIN'!A593","v":"Pas de questions ou d'autres remarques"}]
["Merci de répondre ici ou de mentionner le nom de l'annexe à laquelle vous souhaitez faire référence et d'agrandir la céllule en fonction de la langueur de votre réponse, svp."]

{"sheet":"INSTRUCTION DEMANDE DE BUDGET","index":3,"n_rows":41,"n_cols":1,"rows_kept":41,"cut":false,"hidden":true,"merged":[[24,0,27,0]]}
["INSTRUCTION DEMANDE DE BUDGET"]
[]
["LORS D'UN NOUVEAU PROJET OU D'UNE PROLONGATION DE PROJET"]
["LE DELAIS"]
[" Au plus tard le 01 octobre N-1 de l'année avant le début du projet de l'année N"]
[]
["LES DOCUMENTS"]
[" 1) le document excel doit contenir les informations suivantes:"]
["          *la demande de budget par type de coûts financés par Fedasil et/ou d'autres sources de financement"]
[" 2) la partie financière du rapport relatif au contenu  "]
[]
["LE FORMAT DES DOCUMENTS"]
["version électronique + version imprimée en un exemplaire"]
[]
["REMARQUES POUR REMPLIR LE BUDGET"]
[" 1) Les cellules bleues sont les cellules à complèter"]
[" 2) Les cellules en blanches sont celles avec les formules"]
[" 3) Amortir les investissements supérieures à 500 € "]
[]
[]
["BUDGETWIJZIGING TIJDENS DE LOOP VAN HET JAAR"]
["OVERDRACHT TUSSEN RUBRIEKEN<10%"]
["De begunstigde kan bij de uitvoering van het project de begroting aanpassen door overdrachten tussen rubrieken, mits deze aanpassing de uitvoering van het project niet in de weg staat en het bedrag van de overdracht tussen rubrieken niet meer bedraagt dan 10% van het bedrag van elke rubriek van het budget, en zonder dat dit het vermelde bedrag aan totale subsidiabele kosten wijzigt. Zij stellen het Agentschap hiervan schriftelijk in kennis. "]
["OVERDRACHT TUSSEN RUBRIEKEN>10%"]
["Overdrachten tussen rubrieken van meer dan 10% zijn uitzonderlijk aanvaardbaar mits deze aanpassing de uitvoering van het project niet in de weg staat en zonder dat dit het vermelde bedrag aan totale subsidiabele kosten wijzigt. \nDe begunstigde dient voorafgaandelijk het akkoord van het Agentschap te vragen aan de hand van een verzoek tot budgetwijziging, dat bestaat uit een vergelijking van het aangepast budget met het initieel budget en een uitgebreide argumentatie voor alle aanpassingen. \nDeze schriftelijke kennisgevingen en aanvragen tot budgetwijzigingen dienen steeds te gebeuren 1 maand voor het einde van de overeenkomst.\n\n"]
[]
[]
[]
[]
["TAB BUDGETWIJZIGING"]
["Het budgetwijzigingsdocument is reeds ingevuld aan de hand van het initieel goedgekeurd budget. Alle cellen die u in deze tab zal wijzigen, zullen"]
["automatische veranderen van kleur zodat de aanpassingen direct zichtbaar zijn. "]
[]
[]
["WAT WENST U NU TE DOEN?"]
["← klik op button"]
["← klik op button"]
["← klik op button"]
["← klik op button"]
[]
["WAT WENST U NU TE DOEN?"]

{"sheet":"DEMANDE DE BUDGET","index":4,"n_rows":83,"n_cols":15,"rows_kept":83,"cut":false,"hidden":true,"merged":[[34,2,34,4],[35,2,35,4],[36,2,36,4],[31,2,31,4],[32,2,32,4],[33,2,33,4],[3,12,3,14],[65,6,65,10],[82,6,82,9],[8,5,8,14],[9,5,9,14],[12,5,12,14],[13,5,13,14],[14,5,14,14],[10,5,10,14],[11,6,11,14],[66,2,66,9],[80,2,80,9],[7,2,7,4],[7,5,7,14],[28,2,28,4],[29,2,29,4],[30,2,30,4],[25,2,25,4],[26,2,26,4],[21,3,21,4],[22,3,22,4],[23,3,23,4],[24,3,24,4],[27,2,27,4],[17,3,17,4],[16,2,16,4],[18,3,18,4],[19,3,19,4],[20,3,20,4],[8,2,8,4],[9,2,9,4],[10,2,10,4],[11,2,11,4],[15,2,15,4],[52,2,52,3],[51,2,51,4],[53,2,53,3],[59,2,59,3],[60,2,60,3],[62,2,62,4],[54,2,54,3],[55,2,55,3],[56,2,56,3],[57,2,57,3],[58,2,58,3],[61,2,61,3],[37,2,37,4],[50,2,50,4],[38,2,38,3],[39,2,39,3],[40,2,40,3],[49,2,49,4],[41,2,41,3],[42,2,42,3],[43,2,43,3],[44,2,44,3],[45,2,45,3],[46,2,46,3],[47,2,47,3],[48,2,48,4],[63,2,63,4],[73,2,73,4],[74,2,74,4],[79,2,79,4],[64,2,64,4],[75,2,75,4],[76,2,76,4],[77,2,77,4],[78,2,78,4],[39,5,39,6],[40,5,40,6],[41,5,41,6],[42,5,42,6],[43,5,43,6],[49,5,49,6],[44,5,44,6],[45,5,45,6],[46,5,46,6],[47,5,47,6],[48,5,48,6]]}
[]
[]
[]
[null,null,null,null,null,null,null,null,null,null,null,null,"DEMANDE DE BUDGET"]
[]
[]
[]
[null,null,"Date de la demande :",null,null,{"$f":"TODAY()","v":"2020-09-11"}]
[null,null,{"$f":"'ETAPE 1'!A11","v":"Bénéficiaire (asbl) :"},null,null,{"$f":"'ETAPE 1'!D11","v":0}]
[null,null,{"$f":"'ETAPE 1'!A12","v":"Nom du projet :"},null,null,{"$f":"'ETAPE 1'!D12","v":0}]
[null,null,{"$f":"'ETAPE 1'!A14","v":"Gestionnaire financièr du projet : "},null,null,{"$f":"'ETAPE 1'!D14","v":0}]
[null,null,"Durée du projet (nombre de mois) :",null,null,0,{"$f":"IF(OR(F12=0,F12>=13),\"Veuillez indiquer une durée\",\" \")","v":"Veuillez indiquer une durée"}]
[null,null,null,null,null,"INSTRUCTION"]
[null,null,null,null,null,"!!!!! LES CELLULES BLEUES SONT LES CELLULES A COMPLETER !!!!"]
[null,null,null,null,null,"!!!! LES CELLULES BLANCHES SONT CELLES AVEC LES FORMULES!!!!"]
[null,null,"Budget 2021",null,null,"ETP","Coût unitaire (par mois)","Coût unitaire (par an)","Nombre de mois du projet","% de temps au projet","Montant total du projet","Demande de subside Fedasil (projet ou activité)","% Fedasil","Autres sources de financement","% autres sources"]
[null,null,"Personnel",null,null,"(étape1)","(étape2)",null,"(étape3)","(étape4)",null,"(étape5)"]
[null,null,"(nom à compléter)","(fonction à compléter)",null,0,0,{"$f":"G18*12","v":0},0,0,{"$f":"J18*I18*G18","v":0},0,{"$f":"IF(K18=0,0,L18/K18)","v":0},{"$f":"K18-L18","v":0},{"$f":"IF(K18=0,0,N18/K18)","v":0}]
[null,null,"(nom à compléter)","(fonction à compléter)",null,0,0,{"$f":"G19*12","v":0},0,0,{"$f":"J19*I19*G19","v":0},0,{"$f":"IF(K19=0,0,L19/K19)","v":0},{"$f":"K19-L19","v":0},{"$f":"IF(K19=0,0,N19/K19)","v":0}]
[null,null,"(nom à compléter)","(fonction à compléter)",null,0,0,0,0,0,0,0,{"$f":"IF(K20=0,0,L20/K20)","v":0},0,{"$f":"IF(K20=0,0,N20/K20)","v":0}]
[null,null,"(nom à compléter)","(fonction à compléter)",null,0,0,0,0,0,0,0,0,0,0]
[null,null,"(nom à compléter)","(fonction à compléter)",null,0,0,0,0,0,0,0,0,0,0]
[null,null,"(nom à compléter)","(fonction à compléter)",null,0,0,0,0,0,0,0,0,0,0]
[null,null,"(nom à compléter)","(fonction à compléter)",null,0,0,0,0,0,0,0,0,0,0]
[null,null,"(nom à compléter)","(fonction à compléter)",null,0,0,{"$f":"G25*12","v":0},0,0,0,0,0,0,0]
[null,null,"Total",null,null,{"$f":"SUM(F18:F25)","v":0},null,{"$f":"SUM(H18:H25)","v":0},null,null,{"$f":"SUM(K18:K25)","v":0},{"$f":"SUM(L18:L25)","v":0},{"$f":"IF(K26=0,0,L26/K26)","v":0},{"$f":"SUM(N18:N25)","v":0},{"$f":"IF(K26=0,0,N26/K26)","v":0}]
[null,null,"Location"]
[null,null,"(Objet/Bâtiment & Adresse à compléter)",null,null,null,0,{"$f":"+G28*12","v":0},0,0,{"$f":"J28*I28*G28","v":0},0,{"$f":"IF(K28=0,0,L28/K28)","v":0},{"$f":"K28-L28","v":0},{"$f":"IF(K28=0,0,N28/K28)","v":0}]
[null,null,"(Objet/Bâtiment & Adresse à compléter)",null,null,null,0,{"$f":"+G29*12","v":0},0,0,{"$f":"J29*I29*G29","v":0},0,{"$f":"IF(K29=0,0,L29/K29)","v":0},{"$f":"K29-L29","v":0},{"$f":"IF(K29=0,0,N29/K29)","v":0}]
[null,null,"(Objet/Bâtiment & Adresse à compléter)",null,null,null,0,{"$f":"+G30*12","v":0},0,0,{"$f":"J30*I30*G30","v":0},0,0,{"$f":"K30-L30","v":0},0]
[null,null,"(Objet/Bâtiment & Adresse à compléter)",null,null,null,0,{"$f":"+G31*12","v":0},0,0,{"$f":"J31*I31*G31","v":0},0,0,{"$f":"K31-L31","v":0},0]
[null,null,"Total",null,null,null,null,{"$f":"SUM(H28:H31)","v":0},null,null,{"$f":"SUM(K28:K31)","v":0},{"$f":"SUM(L28:L31)","v":0},{"$f":"IF(K32=0,0,L32/K32)","v":0},{"$f":"SUM(N28:N31)","v":0},{"$f":"IF(K32=0,0,N32/K32)","v":0}]
[null,null,"Investissements (amortissements si > 500€) "]
[null,null,"(Compléter la description) ",null,null,null,null,0,null,0,{"$f":"H34*J34","v":0},0,0,{"$f":"K34-L34","v":0},0]
[null,null,"(à compléter) ",null,null,null,null,0,null,0,{"$f":"H35*J35","v":0},0,0,{"$f":"K35-L35","v":0},0]
[null,null,"(à compléter) ",null,null,null,null,0,null,0,{"$f":"H36*J36","v":0},0,0,{"$f":"K36-L36","v":0},0]
[null,null,"(à compléter) ",null,null,null,null,0,null,0,{"$f":"H37*J37","v":0},0,0,{"$f":"K37-L37","v":0},0]
[null,null,"Total",null,null,null,null,{"$f":"SUM(H34:H37)","v":0},null,null,{"$f":"SUM(K34:K37)","v":0},{"$f":"SUM(L34:L37)","v":0},0,{"$f":"SUM(N34:N37)","v":0},0]
[null,null,"Frais de fonctionnement directs**"]
[null,null,"Choisissez dans la liste Frais de fonctionnement directs",null,"\u0080",{"$f":"IF(C40=\"Sous-traitance \",\"Donnez plus d'infos ici\",\" \")","v":" "},null,0,null,null,{"$f":"H40","v":0},{"$f":"K40","v":0},{"$f":"IF(K40=0,0,L40/K40)","v":0},{"$f":"K40-L40","v":0},{"$f":"IF(K40=0,0,N40/K40)","v":0}]
[null,null,"Choisissez dans la liste Frais de fonctionnement directs",null,"\u0080"," ",null,0,null,null,{"$f":"H41","v":0},{"$f":"K41","v":0},{"$f":"IF(K41=0,0,L41/K41)","v":0},0,{"$f":"IF(K41=0,0,N41/K41)","v":0}]
[null,null,"Choisissez dans la liste Frais de fonctionnement directs",null,"\u0080"," ",null,0,null,null,{"$f":"H42","v":0},{"$f":"K42","v":0},{"$f":"IF(K42=0,0,L42/K42)","v":0},0,{"$f":"IF(K42=0,0,N42/K42)","v":0}]
[null,null,"Choisissez dans la liste Frais de fonctionnement directs",null,"\u0080"," ",null,0,null,null,{"$f":"H43","v":0},{"$f":"K43","v":0},{"$f":"IF(K43=0,0,L43/K43)","v":0},0,{"$f":"IF(K43=0,0,N43/K43)","v":0}]
[null,null,"Choisissez dans la liste Frais de fonctionnement directs",null,"\u0080"," ",null,0,null,null,{"$f":"H44","v":0},{"$f":"K44","v":0},{"$f":"IF(K44=0,0,L44/K44)","v":0},0,{"$f":"IF(K44=0,0,N44/K44)","v":0}]
[null,null,"Choisissez dans la liste Frais de fonctionnement directs",null,"\u0080"," ",null,0,null,null,{"$f":"H45","v":0},{"$f":"K45","v":0},0,0,0]
[null,null,"Choisissez dans la liste Frais de fonctionnement directs",null,"\u0080"," ",null,0,null,null,0,0,0,0,0]
[null,null,"Choisissez dans la liste Frais de fonctionnement directs",null,"\u0080"," ",null,0,null,null,0,0,0,0,0]
[null,null,"Choisissez dans la liste Frais de fonctionnement directs",null,"\u0080"," ",null,0,null,null,0,0,0,0,0]
[null,null,"Autre : (compléter soi-même)",null,null," ",null,0,null,null,{"$f":"H49","v":0},{"$f":"K49","v":0},{"$f":"IF(K49=0,0,L49/K49)","v":0},{"$f":"K49-L49","v":0},{"$f":"IF(K49=0,0,N49/K49)","v":0}]
[null,null,"Autre : (compléter soi-même)",null,null," ",null,0,null,null,{"$f":"H50","v":0},{"$f":"K50","v":0},{"$f":"IF(K50=0,0,L50/K50)","v":0},{"$f":"K50-L50","v":0},{"$f":"IF(K50=0,0,N50/K50)","v":0}]
[null,null,"Total",null,null,null,null,{"$f":"SUM(H40:H50)","v":0},null,null,{"$f":"SUM(K40:K50)","v":0},{"$f":"SUM(L40:L50)","v":0},{"$f":"IF(K51=0,0,L51/K51)","v":0},{"$f":"SUM(N40:N50)","v":0},0]
[null,null,"Frais de fonctionnement indirects***"]
[null,null,"Choisissez dans la liste Frais de fonctionnement indirects",null,"\u0080",null,null,0,null,0,{"$f":"H53*J53","v":0},0,{"$f":"IF(K53=0,0,L53/K53)","v":0},{"$f":"K53-L53","v":0},{"$f":"IF(K53=0,0,N53/K53)","v":0}]
[null,null,"Choisissez dans la liste Frais de fonctionnement indirects",null,"\u0080",null,null,0,null,0,{"$f":"H54*J54","v":0},0,{"$f":"IF(K54=0,0,L54/K54)","v":0},{"$f":"K54-L54","v":0},{"$f":"IF(K54=0,0,N54/K54)","v":0}]
[null,null,"Choisissez dans la liste Frais de fonctionnement indirects",null,"\u0080",null,null,0,null,0,{"$f":"H55*J55","v":0},0,{"$f":"IF(K55=0,0,L55/K55)","v":0},{"$f":"K55-L55","v":0},{"$f":"IF(K55=0,0,N55/K55)","v":0}]
[null,null,"Choisissez dans la liste Frais de fonctionnement indirects",null,"\u0080",null,null,0,null,0,{"$f":"H56*J56","v":0},0,0,{"$f":"K56-L56","v":0},0]
[null,null,"Choisissez dans la liste Frais de fonctionnement indirects",null,"\u0080",null,null,0,null,0,{"$f":"H57*J57","v":0},0,0,{"$f":"K57-L57","v":0},0]
[null,null,"Choisissez dans la liste Frais de fonctionnement indirects",null,"\u0080",null,null,0,null,0,{"$f":"H58*J58","v":0},0,0,{"$f":"K58-L58","v":0},0]
[null,null,"Choisissez dans la liste Frais de fonctionnement indirects",null,"\u0080",null,null,0,null,0,0,0,0,0,0]
[null,null,"Choisissez dans la liste Frais de fonctionnement indirects",null,"\u0080",null,null,0,null,0,0,0,0,0,0]
[null,null,"Choisissez dans la liste Frais de fonctionnement indirects",null,"\u0080",null,null,0,null,0,0,0,0,0,0]
[null,null,"Choisissez dans la liste Frais de fonctionnement indirects",null,"\u0080",null,null,0,null,0,0,0,0,0,0]
[null,null,"Autre : (compléter soi-même)",null,null,null,null,0,null,0,0,0,0,0,0]
[null,null,"Autre : (compléter soi-même)",null,null,null,null,0,null,0,{"$f":"H64*J64","v":0},0,{"$f":"IF(K64=0,0,L64/K64)","v":0},{"$f":"K64-L64","v":0},{"$f":"IF(K64=0,0,N64/K64)","v":0}]
[null,null,"Total",null,null,null,null,{"$f":"SUM(H53:H64)","v":0},null,null,{"$f":"SUM(K53:K64)","v":0},{"$f":"SUM(L53:L64)","v":0},{"$f":"IF(K65=0,0,L65/K65)","v":0},{"$f":"SUM(N53:N64)","v":0},{"$f":"IF(K65=0,0,N65/K65)","v":0}]
[null,null,null,null,null,null,"MAX DE FRAIS INDIRECTS AUTORISES ****:",null,null,null,null,{"$f":"(L26+L32+L38+L51)*0.07","v":0}]
[null,null,"TOTAL",null,null,null,null,null,null,null,{"$f":"K65+K51+K38+K32+K26","v":0},{"$f":"L65+L51+L38+L32+L26","v":0},0,{"$f":"N65+N51+N38+N32+N26","v":0},0]
[null,null,"* Si une partie ou l'entièreté de la subvention est utilisée comme co-financement, la répartition doit être indiquée ici. Veuillez ajouter une colonne par projet. "]
[null,null,"** Frais de fonctionnement directs. Il s'agit de frais attribués de manière comptable au projet ou à l'activité. Si pas possible, ces frais peuvent être catégorisés comme 'frais de fonctionnement indirects'.   "]
[null,null,"*** Frais de fonctionnement indirects : Il s'agit de frais qui ne peuvent pas être entièrement attribués de manière comptable au projet ou à l'activité. Ces frais sont attribués via une clef de répartition."]
[null,null,"     La clef de répartition utilisée doit être motivée dans le rapport relatif au contenu. "]
[null,null,"**** max de frais indirects autorisés avec les subsides de Fedasil : 7% de la somme du personnel, de la location, des investissements et des frais de fonctionnement directs"]
[]
[null,null,"Financement",null,null,null,"Identification de la source de financement","Assurance",null,null,"Montant total du projet","Demande de subside Fedasil (projet ou activité)","% Fedasil","Autres sources de financement","% autres sources"]
[null,null,"Fedasil",null,null,null,null,"Demandé",null,null,{"$f":"L75","v":0},{"$f":"L67","v":0},{"$f":"IF($K$67=0,0,L75/$K$67)","v":0}]
[null,null,"Moyens propres",null,null,null,"(à compléter)","(à compléter)",null,null,{"$f":"N76","v":0},null,null,0,{"$f":"IF($K$67=0,0,N76/$K$67)","v":0}]
[null,null,"Autre rentrées : (compléter soi-même)",null,null,null,"(à compléter)","(à compléter)",null,null,{"$f":"N77","v":0},null,null,0,0]
[null,null,"Autre rentrées : (compléter soi-même)",null,null,null,"(à compléter)","(à compléter)",null,null,{"$f":"N78","v":0},null,null,0,0]
[null,null,"Autre rentrées : (compléter soi-même)",null,null,null,"(à compléter)","(à compléter)",null,null,{"$f":"N79","v":0},null,null,0,0]
[null,null,"Autre rentrées : (compléter soi-même)",null,null,null,"(à compléter)","(à compléter)",null,null,{"$f":"N80","v":0},null,null,0,0]
[null,null,"TOTAL",null,null,null,null,null,null,null,{"$f":"SUM(K75:K80)","v":0},{"$f":"SUM(L75:L80)","v":0},{"$f":"IF($K$67=0,0,L81/$K$67)","v":0},{"$f":"SUM(N76:N80)","v":0},{"$f":"IF($K$67=0,0,N81/$K$67)","v":0}]
[]
[null,null,null,null,null,null,"DIFFERENCE ENTRE BUDGET ET FINANCEMENT",null,null,null,{"$f":"K67-K81","v":0},null,null,{"$f":"N67-N81","v":0}]

{"sheet":"BUDGET INI APPROUVE","index":5,"n_rows":83,"n_cols":14,"rows_kept":83,"cut":false,"hidden":true,"merged":[[2,9,3,10],[49,4,49,5],[44,4,44,5],[45,4,45,5],[46,4,46,5],[47,4,47,5],[48,4,48,5],[39,4,39,5],[40,4,40,5],[41,4,41,5],[42,4,42,5],[43,4,43,5],[3,11,3,13],[65,5,65,9],[82,5,82,8],[8,4,8,13],[9,4,9,13],[11,4,11,13],[10,4,10,13],[7,4,7,13],[2,5,3,8],[51,2,51,4],[48,2,48,3],[49,2,49,3],[7,2,7,3],[8,2,8,3],[9,2,9,3],[10,2,10,3],[11,2,11,3],[15,2,15,3],[25,2,25,3],[31,2,31,3],[37,2,37,3],[30,2,30,3],[32,2,32,3],[27,2,27,3],[26,2,26,3],[16,2,16,3],[28,2,28,3],[29,2,29,3],[33,2,33,3],[34,2,34,3],[35,2,35,3],[36,2,36,3],[52,2,52,3],[53,2,53,3],[41,2,41,3],[42,2,42,3],[43,2,43,3],[44,2,44,3],[38,2,38,3],[39,2,39,3],[40,2,40,3],[50,2,50,3],[45,2,45,3],[46,2,46,3],[47,2,47,3],[54,2,54,3],[55,2,55,3],[56,2,56,3],[57,2,57,3],[58,2,58,3],[64,2,64,3],[66,2,66,8],[76,2,76,3],[59,2,59,3],[60,2,60,3],[61,2,61,3],[63,2,63,3],[73,2,73,3],[62,2,62,3],[77,2,77,3],[78,2,78,3],[79,2,79,3],[80,2,80,8],[74,2,74,3],[75,2,75,3]]}
[]
[]
[null,null,null,null,null,"BUDGET APPROUVE",null,null,null,"2021/XX"]
[]
[]
[]
[]
[null,null,{"$f":"'DEMANDE DE BUDGET'!C8","v":"Date de la demande :"},null,{"$f":"'DEMANDE DE BUDGET'!F8","v":"2020-09-11"}]
[null,null,"Bénéficiaire :",null,{"$f":"'DEMANDE DE BUDGET'!F9","v":0}]
[null,null,"Project :",null,{"$f":"'DEMANDE DE BUDGET'!F10","v":0}]
[null,null,"Personne de contact",null,{"$f":"'DEMANDE DE BUDGET'!F11","v":0}]
[null,null,"Durée du projet (nombre de mois) :",null,{"$f":"'DEMANDE DE BUDGET'!F12","v":0}]
[]
[]
[]
[null,null,{"$f":"'DEMANDE DE BUDGET'!C16","v":"Budget 2021"},null,"ETP","Coût unitaire (par mois)","Coût unitaire (par an)","Nombre de mois du projet","% de temps au projet","Montant total du projet","Budget Fedasil  Approuvé (projet ou activité)","% Fedasil","Autres sources de financement","% autres sources"]
[null,null,"Personnel",null,"(étape1)","(étape2)",null,"(étape3)","(étape4)",null,"(étape 5)"]
[null,null,{"$f":"'DEMANDE DE BUDGET'!C18","v":"(nom à compléter)"},{"$f":"'DEMANDE DE BUDGET'!D18","v":"(fonction à compléter)"},{"$f":"'DEMANDE DE BUDGET'!F18","v":0},{"$f":"'DEMANDE DE BUDGET'!G18","v":0},{"$f":"F18*12","v":0},{"$f":"'DEMANDE DE BUDGET'!I18","v":0},{"$f":"'DEMANDE DE BUDGET'!J18","v":0},{"$f":"I18*H18*F18","v":0},{"$f":"'DEMANDE DE BUDGET'!L18","v":0},{"$f":"IF(J18=0,0,K18/J18)","v":0},{"$f":"J18-K18","v":0},{"$f":"IF(J18=0,0,M18/J18)","v":0}]
[null,null,{"$f":"'DEMANDE DE BUDGET'!C19","v":"(nom à compléter)"},{"$f":"'DEMANDE DE BUDGET'!D19","v":"(fonction à compléter)"},{"$f":"'DEMANDE DE BUDGET'!F19","v":0},{"$f":"'DEMANDE DE BUDGET'!G19","v":0},{"$f":"F19*12","v":0},{"$f":"'DEMANDE DE BUDGET'!I19","v":0},{"$f":"'DEMANDE DE BUDGET'!J19","v":0},0,{"$f":"'DEMANDE DE BUDGET'!L19","v":0},{"$f":"IF(J19=0,0,K19/J19)","v":0},{"$f":"J19-K19","v":0},{"$f":"IF(J19=0,0,M19/J19)","v":0}]
[null,null,{"$f":"'DEMANDE DE BUDGET'!C20","v":"(nom à compléter)"},{"$f":"'DEMANDE DE BUDGET'!D20","v":"(fonction à compléter)"},{"$f":"'DEMANDE DE BUDGET'!F20","v":0},{"$f":"'DEMANDE DE BUDGET'!G20","v":0},0,{"$f":"'DEMANDE DE BUDGET'!I20","v":0},{"$f":"'DEMANDE DE BUDGET'!J20","v":0},0,{"$f":"'DEMANDE DE BUDGET'!L20","v":0},{"$f":"IF(J20=0,0,K20/J20)","v":0},0,{"$f":"IF(J20=0,0,M20/J20)","v":0}]
[null,null,{"$f":"'DEMANDE DE BUDGET'!C21","v":"(nom à compléter)"},{"$f":"'DEMANDE DE BUDGET'!D21","v":"(fonction à compléter)"},{"$f":"'DEMANDE DE BUDGET'!F21","v":0},{"$f":"'DEMANDE DE BUDGET'!G21","v":0},0,{"$f":"'DEMANDE DE BUDGET'!I21","v":0},{"$f":"'DEMANDE DE BUDGET'!J21","v":0},0,{"$f":"'DEMANDE DE BUDGET'!L21","v":0},0,0,0]
[null,null,{"$f":"'DEMANDE DE BUDGET'!C22","v":"(nom à compléter)"},{"$f":"'DEMANDE DE BUDGET'!D22","v":"(fonction à compléter)"},{"$f":"'DEMANDE DE BUDGET'!F22","v":0},{"$f":"'DEMANDE DE BUDGET'!G22","v":0},0,{"$f":"'DEMANDE DE BUDGET'!I22","v":0},{"$f":"'DEMANDE DE BUDGET'!J22","v":0},0,{"$f":"'DEMANDE DE BUDGET'!L22","v":0},0,0,0]
[null,null,{"$f":"'DEMANDE DE BUDGET'!C23","v":"(nom à compléter)"},{"$f":"'DEMANDE DE BUDGET'!D23","v":"(fonction à compléter)"},{"$f":"'DEMANDE DE BUDGET'!F23","v":0},{"$f":"'DEMANDE DE BUDGET'!G23","v":0},0,{"$f":"'DEMANDE DE BUDGET'!I23","v":0},{"$f":"'DEMANDE DE BUDGET'!J23","v":0},0,{"$f":"'DEMANDE DE BUDGET'!L23","v":0},0,0,0]
[null,null,{"$f":"'DEMANDE DE BUDGET'!C24","v":"(nom à compléter)"},{"$f":"'DEMANDE DE BUDGET'!D24","v":"(fonction à compléter)"},{"$f":"'DEMANDE DE BUDGET'!F24","v":0},{"$f":"'DEMANDE DE BUDGET'!G24","v":0},0,{"$f":"'DEMANDE DE BUDGET'!I24","v":0},{"$f":"'DEMANDE DE BUDGET'!J24","v":0},0,{"$f":"'DEMANDE DE BUDGET'!L24","v":0},0,0,0]
[null,null,{"$f":"'DEMANDE DE BUDGET'!C25","v":"(nom à compléter)"},{"$f":"'DEMANDE DE BUDGET'!D25","v":"(fonction à compléter)"},{"$f":"'DEMANDE DE BUDGET'!F25","v":0},{"$f":"'DEMANDE DE BUDGET'!G25","v":0},{"$f":"F25*12","v":0},{"$f":"'DEMANDE DE BUDGET'!I25","v":0},{"$f":"'DEMANDE DE BUDGET'!J25","v":0},0,{"$f":"'DEMANDE DE BUDGET'!L25","v":0},0,0,0]
[null,null,"Total",null,{"$f":"SUM(E18:E25)","v":0},null,{"$f":"SUM(G18:G25)","v":0},null,null,{"$f":"SUM(J18:J25)","v":0},{"$f":"SUM(K18:K25)","v":0},{"$f":"IF(J26=0,0,K26/J26)","v":0},{"$f":"SUM(M18:M25)","v":0},{"$f":"IF(J26=0,0,M26/J26)","v":0}]
[null,null,"Location"]
[null,null,{"$f":"'DEMANDE DE BUDGET'!C28","v":"(Objet/Bâtiment & Adresse à compléter)"},null,null,{"$f":"'DEMANDE DE BUDGET'!G28","v":0},{"$f":"+F28*12","v":0},{"$f":"'DEMANDE DE BUDGET'!I28","v":0},{"$f":"'DEMANDE DE BUDGET'!J28","v":0},{"$f":"I28*H28*F28","v":0},{"$f":"'DEMANDE DE BUDGET'!L28","v":0},0,{"$f":"J28-K28","v":0},0]
[null,null,{"$f":"'DEMANDE DE BUDGET'!C29","v":"(Objet/Bâtiment & Adresse à compléter)"},null,null,{"$f":"'DEMANDE DE BUDGET'!G29","v":0},{"$f":"+F29*12","v":0},{"$f":"'DEMANDE DE BUDGET'!I29","v":0},{"$f":"'DEMANDE DE BUDGET'!J29","v":0},{"$f":"I29*H29*F29","v":0},{"$f":"'DEMANDE DE BUDGET'!L29","v":0},0,{"$f":"J29-K29","v":0},0]
[null,null,{"$f":"'DEMANDE DE BUDGET'!C30","v":"(Objet/Bâtiment & Adresse à compléter)"},null,null,{"$f":"'DEMANDE DE BUDGET'!G30","v":0},{"$f":"+F30*12","v":0},{"$f":"'DEMANDE DE BUDGET'!I30","v":0},{"$f":"'DEMANDE DE BUDGET'!J30","v":0},{"$f":"I30*H30*F30","v":0},{"$f":"'DEMANDE DE BUDGET'!L30","v":0},0,{"$f":"J30-K30","v":0},0]
[null,null,{"$f":"'DEMANDE DE BUDGET'!C31","v":"(Objet/Bâtiment & Adresse à compléter)"},null,null,{"$f":"'DEMANDE DE BUDGET'!G31","v":0},{"$f":"+F31*12","v":0},{"$f":"'DEMANDE DE BUDGET'!I31","v":0},{"$f":"'DEMANDE DE BUDGET'!J31","v":0},{"$f":"I31*H31*F31","v":0},{"$f":"'DEMANDE DE BUDGET'!L31","v":0},0,{"$f":"J31-K31","v":0},0]
[null,null,{"$f":"'DEMANDE DE BUDGET'!C32","v":"Total"},null,null,null,{"$f":"SUM(G28:G31)","v":0},null,null,{"$f":"SUM(J28:J31)","v":0},{"$f":"SUM(K28:K31)","v":0},{"$f":"IF(J32=0,0,K32/J32)","v":0},{"$f":"SUM(M28:M31)","v":0},{"$f":"IF(J32=0,0,M32/J32)","v":0}]
[null,null,"Investissements (ex. hardware et/ou software) "]
[null,null,{"$f":"'DEMANDE DE BUDGET'!C34","v":"(Compléter la description) "},null,null,null,{"$f":"'DEMANDE DE BUDGET'!H34","v":0},null,{"$f":"'DEMANDE DE BUDGET'!J34","v":0},{"$f":"G34*I34","v":0},{"$f":"'DEMANDE DE BUDGET'!L34","v":0},0,{"$f":"J34-K34","v":0},0]
[null,null,{"$f":"'DEMANDE DE BUDGET'!C35","v":"(à compléter) "},null,null,null,{"$f":"'DEMANDE DE BUDGET'!H35","v":0},null,{"$f":"'DEMANDE DE BUDGET'!J35","v":0},{"$f":"G35*I35","v":0},{"$f":"'DEMANDE DE BUDGET'!L35","v":0},0,{"$f":"J35-K35","v":0},0]
[null,null,{"$f":"'DEMANDE DE BUDGET'!C36","v":"(à compléter) "},null,null,null,{"$f":"'DEMANDE DE BUDGET'!H36","v":0},null,{"$f":"'DEMANDE DE BUDGET'!J36","v":0},{"$f":"G36*I36","v":0},{"$f":"'DEMANDE DE BUDGET'!L36","v":0},0,{"$f":"J36-K36","v":0},0]
[null,null,{"$f":"'DEMANDE DE BUDGET'!C37","v":"(à compléter) "},null,null,null,{"$f":"'DEMANDE DE BUDGET'!H37","v":0},null,{"$f":"'DEMANDE DE BUDGET'!J37","v":0},{"$f":"G37*I37","v":0},{"$f":"'DEMANDE DE BUDGET'!L37","v":0},0,{"$f":"J37-K37","v":0},0]
[null,null,"Total",null,null,null,{"$f":"SUM(G34:G37)","v":0},null,null,{"$f":"SUM(J34:J37)","v":0},{"$f":"SUM(K34:K37)","v":0},0,{"$f":"SUM(M34:M37)","v":0},0]
[null,null,"Frais de fonctionnement directs**"]
[null,null,{"$f":"'DEMANDE DE BUDGET'!C40","v":"Choisissez dans la liste Frais de fonctionnement directs"},null,{"$f":"'DEMANDE DE BUDGET'!F40","v":" "},null,{"$f":"'DEMANDE DE BUDGET'!H40","v":0},null,null,{"$f":"G40","v":0},{"$f":"'DEMANDE DE BUDGET'!L40","v":0},0,{"$f":"J40-K40","v":0},0]
[null,null,{"$f":"'DEMANDE DE BUDGET'!C41","v":"Choisissez dans la liste Frais de fonctionnement directs"},null,{"$f":"'DEMANDE DE BUDGET'!F41","v":" "},null,{"$f":"'DEMANDE DE BUDGET'!H41","v":0},null,null,{"$f":"G41","v":0},{"$f":"'DEMANDE DE BUDGET'!L41","v":0},0,{"$f":"J41-K41","v":0},0]
[null,null,{"$f":"'DEMANDE DE BUDGET'!C42","v":"Choisissez dans la liste Frais de fonctionnement directs"},null,{"$f":"'DEMANDE DE BUDGET'!F42","v":" "},null,{"$f":"'DEMANDE DE BUDGET'!H42","v":0},null,null,0,{"$f":"'DEMANDE DE BUDGET'!L42","v":0},0,0,0]
[null,null,{"$f":"'DEMANDE DE BUDGET'!C43","v":"Choisissez dans la liste Frais de fonctionnement directs"},null,{"$f":"'DEMANDE DE BUDGET'!F43","v":" "},null,{"$f":"'DEMANDE DE BUDGET'!H43","v":0},null,null,0,{"$f":"'DEMANDE DE BUDGET'!L43","v":0},0,0,0]
[null,null,{"$f":"'DEMANDE DE BUDGET'!C44","v":"Choisissez dans la liste Frais de fonctionnement directs"},null,{"$f":"'DEMANDE DE BUDGET'!F44","v":" "},null,{"$f":"'DEMANDE DE BUDGET'!H44","v":0},null,null,0,{"$f":"'DEMANDE DE BUDGET'!L44","v":0},0,0,0]
[null,null,{"$f":"'DEMANDE DE BUDGET'!C45","v":"Choisissez dans la liste Frais de fonctionnement directs"},null,{"$f":"'DEMANDE DE BUDGET'!F45","v":" "},null,{"$f":"'DEMANDE DE BUDGET'!H45","v":0},null,null,0,{"$f":"'DEMANDE DE BUDGET'!L45","v":0},0,{"$f":"J45-K45","v":0},0]
[null,null,{"$f":"'DEMANDE DE BUDGET'!C46","v":"Choisissez dans la liste Frais de fonctionnement directs"},null,{"$f":"'DEMANDE DE BUDGET'!F46","v":" "},null,{"$f":"'DEMANDE DE BUDGET'!H46","v":0},null,null,0,{"$f":"'DEMANDE DE BUDGET'!L46","v":0},0,{"$f":"J46-K46","v":0},0]
[null,null,{"$f":"'DEMANDE DE BUDGET'!C47","v":"Choisissez dans la liste Frais de fonctionnement directs"},null,{"$f":"'DEMANDE DE BUDGET'!F47","v":" "},null,{"$f":"'DEMANDE DE BUDGET'!H47","v":0},null,null,0,{"$f":"'DEMANDE DE BUDGET'!L47","v":0},0,{"$f":"J47-K47","v":0},0]
[null,null,{"$f":"'DEMANDE DE BUDGET'!C48","v":"Choisissez dans la liste Frais de fonctionnement directs"},null,{"$f":"'DEMANDE DE BUDGET'!F48","v":" "},null,{"$f":"'DEMANDE DE BUDGET'!H48","v":0},null,null,0,{"$f":"'DEMANDE DE BUDGET'!L48","v":0},0,{"$f":"J48-K48","v":0},0]
[null,null,{"$f":"'DEMANDE DE BUDGET'!C49","v":"Autre : (compléter soi-même)"},null,{"$f":"'DEMANDE DE BUDGET'!F49","v":" "},null,{"$f":"'DEMANDE DE BUDGET'!H49","v":0},null,null,{"$f":"G49","v":0},{"$f":"'DEMANDE DE BUDGET'!L49","v":0},{"$f":"IF(J49=0,0,K49/J49)","v":0},{"$f":"J49-K49","v":0},{"$f":"IF(J49=0,0,M49/J49)","v":0}]
[null,null,{"$f":"'DEMANDE DE BUDGET'!C50","v":"Autre : (compléter soi-même)"},null,{"$f":"'DEMANDE DE BUDGET'!F50","v":" "},null,{"$f":"'DEMANDE DE BUDGET'!H50","v":0},null,null,0,{"$f":"'DEMANDE DE BUDGET'!L50","v":0},0,{"$f":"J50-K50","v":0},0]
[null,null,"Total",null,null,null,{"$f":"SUM(G40:G50)","v":0},null,null,{"$f":"SUM(J40:J50)","v":0},{"$f":"SUM(K40:K50)","v":0},{"$f":"IF(J51=0,0,K51/J51)","v":0},{"$f":"SUM(M40:M50)","v":0},0]
[null,null,"Frais de fonctionnement indirects***"]
[null,null,{"$f":"'DEMANDE DE BUDGET'!C53","v":"Choisissez dans la liste Frais de fonctionnement indirects"},null,null,null,{"$f":"'DEMANDE DE BUDGET'!H53","v":0},null,{"$f":"'DEMANDE DE BUDGET'!J53","v":0},{"$f":"G53*I53","v":0},{"$f":"'DEMANDE DE BUDGET'!L53","v":0},0,{"$f":"J53-K53","v":0},0]
[null,null,{"$f":"'DEMANDE DE BUDGET'!C54","v":"Choisissez dans la liste Frais de fonctionnement indirects"},null,null,null,{"$f":"'DEMANDE DE BUDGET'!H54","v":0},null,{"$f":"'DEMANDE DE BUDGET'!J54","v":0},{"$f":"G54*I54","v":0},{"$f":"'DEMANDE DE BUDGET'!L54","v":0},0,{"$f":"J54-K54","v":0},0]
[null,null,{"$f":"'DEMANDE DE BUDGET'!C55","v":"Choisissez dans la liste Frais de fonctionnement indirects"},null,null,null,{"$f":"'DEMANDE DE BUDGET'!H55","v":0},null,{"$f":"'DEMANDE DE BUDGET'!J55","v":0},0,{"$f":"'DEMANDE DE BUDGET'!L55","v":0},0,0,0]
[null,null,{"$f":"'DEMANDE DE BUDGET'!C56","v":"Choisissez dans la liste Frais de fonctionnement indirects"},null,null,null,{"$f":"'DEMANDE DE BUDGET'!H56","v":0},null,{"$f":"'DEMANDE DE BUDGET'!J56","v":0},0,{"$f":"'DEMANDE DE BUDGET'!L56","v":0},0,0,0]
[null,null,{"$f":"'DEMANDE DE BUDGET'!C57","v":"Choisissez dans la liste Frais de fonctionnement indirects"},null,null,null,{"$f":"'DEMANDE DE BUDGET'!H57","v":0},null,{"$f":"'DEMANDE DE BUDGET'!J57","v":0},{"$f":"G57*I57","v":0},{"$f":"'DEMANDE DE BUDGET'!L57","v":0},0,{"$f":"J57-K57","v":0},0]
[null,null,{"$f":"'DEMANDE DE BUDGET'!C58","v":"Choisissez dans la liste Frais de fonctionnement indirects"},null,null,null,{"$f":"'DEMANDE DE BUDGET'!H58","v":0},null,{"$f":"'DEMANDE DE BUDGET'!J58","v":0},{"$f":"G58*I58","v":0},{"$f":"'DEMANDE DE BUDGET'!L58","v":0},0,{"$f":"J58-K58","v":0},0]
[null,null,{"$f":"'DEMANDE DE BUDGET'!C59","v":"Choisissez dans la liste Frais de fonctionnement indirects"},null,null,null,{"$f":"'DEMANDE DE BUDGET'!H59","v":0},null,{"$f":"'DEMANDE DE BUDGET'!J59","v":0},0,{"$f":"'DEMANDE DE BUDGET'!L59","v":0},0,0,0]
[null,null,{"$f":"'DEMANDE DE BUDGET'!C60","v":"Choisissez dans la liste Frais de fonctionnement indirects"},null,null,null,{"$f":"'DEMANDE DE BUDGET'!H60","v":0},null,{"$f":"'DEMANDE DE BUDGET'!J60","v":0},0,{"$f":"'DEMANDE DE BUDGET'!L60","v":0},0,0,0]
[null,null,{"$f":"'DEMANDE DE BUDGET'!C61","v":"Choisissez dans la liste Frais de fonctionnement indirects"},null,null,null,{"$f":"'DEMANDE DE BUDGET'!H61","v":0},null,{"$f":"'DEMANDE DE BUDGET'!J61","v":0},0,{"$f":"'DEMANDE DE BUDGET'!L61","v":0},0,0,0]
[null,null,{"$f":"'DEMANDE DE BUDGET'!C62","v":"Choisissez dans la liste Frais de fonctionnement indirects"},null,null,null,{"$f":"'DEMANDE DE BUDGET'!H62","v":0},null,{"$f":"'DEMANDE DE BUDGET'!J62","v":0},0,{"$f":"'DEMANDE DE BUDGET'!L62","v":0},0,0,0]
[null,null,{"$f":"'DEMANDE DE BUDGET'!C63","v":"Autre : (compléter soi-même)"},null,null,null,{"$f":"'DEMANDE DE BUDGET'!H63","v":0},null,{"$f":"'DEMANDE DE BUDGET'!J63","v":0},{"$f":"G63*I63","v":0},{"$f":"'DEMANDE DE BUDGET'!L63","v":0},{"$f":"IF(J63=0,0,K63/J63)","v":0},{"$f":"J63-K63","v":0},{"$f":"IF(J63=0,0,M63/J63)","v":0}]
[null,null,{"$f":"'DEMANDE DE BUDGET'!C64","v":"Autre : (compléter soi-même)"},null,null,null,{"$f":"'DEMANDE DE BUDGET'!H64","v":0},null,{"$f":"'DEMANDE DE BUDGET'!J64","v":0},0,{"$f":"'DEMANDE DE BUDGET'!L64","v":0},0,0,0]
[null,null,"Total",null,null,null,{"$f":"SUM(G53:G64)","v":0},null,null,{"$f":"SUM(J53:J64)","v":0},{"$f":"SUM(K53:K64)","v":0},{"$f":"IF(J65=0,0,K65/J65)","v":0},{"$f":"SUM(M53:M64)","v":0},{"$f":"IF(J65=0,0,M65/J65)","v":0}]
[null,null,null,null,null,"MAX DE FRAIS INDIRECTS AUTORISES ****:",null,null,null,null,{"$f":"(K26+K32+K38+K51)*0.07","v":0}]
[null,null,"TOTAL",null,null,null,null,null,null,{"$f":"J65+J51+J38+J32+J26","v":0},{"$f":"K65+K51+K38+K32+K26","v":0},0,{"$f":"M65+M51+M38+M32+M26","v":0},0]
[null,null,"* Si une partie ou l'entièreté de la subvention est utilisée comme co-financement, la répartition doit être indiquée ici. Veuillez ajouter une colonne par projet. "]
[null,null,"** Frais de fonctionnement directs. Il s'agit de frais attribués de manière comptable au projet ou à l'activité. Si pas possible, ces frais peuvent être catégorisés comme 'autres frais de fonctionnement'.   "]
[null,null,"*** Frais de fonctionnement indirects : Il s'agit de frais qui ne peuvent pas être entièrement attribués de manière comptable au projet ou à l'activité. Ces frais sont attribués via une clef de répartition."]
[null,null,"     La clef de répartition utilisée doit être déclarée dans le rapport relatif au contenu. "]
[null,null,"**** max de frais indirects autorisés avec les subsides de Fedasil : 7% de la somme du personnel, de la location, des investissements et des frais de fonctionnement directs"]
[]
[null,null,"Financement",null,null,"Identification de la source de financement","Assurance",null,null,"Montant total du projet","Budget Fedasil  Approuvé (projet ou activité)","% Fedasil","Autres sources de financement","% autres sources"]
[null,null,{"$f":"'DEMANDE DE BUDGET'!C75","v":"Fedasil"},null,null,null,"Demandé",null,null,{"$f":"K75","v":0},{"$f":"K67","v":0},{"$f":"IF($J$67=0,0,K75/$J$67)","v":0}]
[null,null,{"$f":"'DEMANDE DE BUDGET'!C76","v":"Moyens propres"},null,null,{"$f":"'DEMANDE DE BUDGET'!G76","v":"(à compléter)"},"(à compléter)",null,null,{"$f":"M76","v":0},null,null,{"$f":"'DEMANDE DE BUDGET'!N76","v":0},{"$f":"IF($J$67=0,0,M76/$J$67)","v":0}]
[null,null,{"$f":"'DEMANDE DE BUDGET'!C77","v":"Autre rentrées : (compléter soi-même)"},null,null,{"$f":"'DEMANDE DE BUDGET'!G77","v":"(à compléter)"},"(à compléter)",null,null,0,null,null,{"$f":"'DEMANDE DE BUDGET'!N77","v":0},0]
[null,null,{"$f":"'DEMANDE DE BUDGET'!C78","v":"Autre rentrées : (compléter soi-même)"},null,null,{"$f":"'DEMANDE DE BUDGET'!G78","v":"(à compléter)"},"(à compléter)",null,null,0,null,null,{"$f":"'DEMANDE DE BUDGET'!N78","v":0},0]
[null,null,{"$f":"'DEMANDE DE BUDGET'!C79","v":"Autre rentrées : (compléter soi-même)"},null,null,{"$f":"'DEMANDE DE BUDGET'!G79","v":"(à compléter)"},"(à compléter)",null,null,{"$f":"M79","v":0},null,null,{"$f":"'DEMANDE DE BUDGET'!N79","v":0},0]
[null,null,{"$f":"'DEMANDE DE BUDGET'!C80","v":"Autre rentrées : (compléter soi-même)"},null,null,{"$f":"'DEMANDE DE BUDGET'!G80","v":"(à compléter)"},"(à compléter)",null,null,0,null,null,{"$f":"'DEMANDE DE BUDGET'!N80","v":0},0]
[null,null,"TOTAL",null,null,null,null,null,null,{"$f":"SUM(J75:J80)","v":0},{"$f":"SUM(K75:K80)","v":0},{"$f":"IF($J$67=0,0,K81/$J$67)","v":0},{"$f":"SUM(M76:M80)","v":0},{"$f":"IF($J$67=0,0,M81/$J$67)","v":0}]
[]
[null,null,null,null,null,"DIFFERENCE ENTRE BUDGET ET FINANCEMENT",null,null,null,{"$f":"J67-J81","v":0},null,null,{"$f":"M67-M81","v":0}]

{"sheet":"INSTRUCTION MODIFICATION BUDGET","index":6,"n_rows":47,"n_cols":1,"rows_kept":47,"cut":false,"hidden":true,"merged":[[18,0,21,0]]}
["INSTRUCTION MODIFICATION DU BUDGET"]
[]
["BUDGETAANVRAAG BIJ NIEUW PROJECT OF PROJECTVERLENGING"]
["TIMING INDIENING"]
["Ten laatste [xx] augustus bij projectverlenging of [xx] december voor een nieuw project in het jaar vóór start projectjaar"]
[]
["FORMAT DOCUMENTEN"]
["elektronische versie + gedrukte versie in één exemplaar"]
[]
["WELKE DOCUMENTEN"]
[" 1)  dit excel document die de volgende informatie moet bevatten: "]
["* budgetaanvraag per kostensoort gefinancieerd door Fedasil en/of andere financieringsbronnen"]
[" 2) het financieel onderdeel van het inhoudelijke verslag "]
[]
["MODIFICATION DU BUDGET DANS LE COURANT DE L'ANNEE"]
["TRANSFERT ENTRE TYPES DE FRAIS <10%"]
["Le bénéficiaire peut adapter le budget lors de l'exécution du projet via des transferts entre les rubriques, à condition que cette adaptation ne fasse pas obstacle à l'exécution du projet et que le montant du transfert entre les types de frais ne s'élève pas à plus de 10% du montant de chaque rubrique du budget, et sans que cela ne modifie le subside accordé par Fedasil. Ils en informent l'Agence par écrit. "]
["TRANSFERT ENTRE LES RUBRIQUES>10%"]
["L’Agence peut, exceptionnellement, autoriser les transferts entre types de frais  de plus de 10% du montant inscrit sous chaque type de frais si cette adaptation n’entrave pas la bonne exécution du projet/de l’activité et si le transfert ne modifie en rien le total du subside accordé par l'Agence. Le bénéficiaire doit demander au préalable l’accord de l’Agence au moyen d’une demande de modification budgétaire, consistant en une comparaison entre le budget revu et le budget initial ainsi qu’en une argumentation détaillée de toutes les modifications. \nCes notifications écrites et ces demandes de modification du budget doivent toujours être introduites 1 mois avant la fin de la convention.  \n\n"]
[]
[]
[]
[]
["ONGLET MODIFICATION DU BUDGET"]
[" 1) Le document de modification du budget a déjà été complété au moyen du budget initialement approuvé. Toutes les cellules que vous modifierez dans\n cet onglet changeront automatiquement de couleur (bleue) de sorte que les adaptations soient directement visibles."]
[" 2) Chaque modification de budget doit être motivé et détailé dans l'argumentaire sous peine de non acceptation"]
[" 3) Les cellules en blanches sont celles avec les formules"]
[]
[]
[]
["WAT WENST U NU TE DOEN?"]
["← klik op button"]
["← klik op button"]
["← klik op button"]
["← klik op button"]
[]
["WAT WENST U NU TE DOEN?"]
[]
[]
[]
[]
[]
[]
[]
[]
[]
["LIGNE DU TEMPS"]

{"sheet":"DEMANDE BUDGET AJU","index":7,"n_rows":149,"n_cols":20,"rows_kept":149,"cut":false,"hidden":true,"merged":[[3,12,3,14],[102,16,103,16],[84,2,84,9],[79,2,79,3],[80,2,80,3],[81,2,81,3],[82,2,82,3],[7,2,7,4],[8,2,8,4],[9,2,9,4],[23,3,23,4],[24,3,24,4],[25,3,25,4],[26,2,26,4],[28,2,28,4],[29,2,29,4],[30,2,30,4],[31,2,31,4],[10,2,10,4],[16,2,16,4],[11,2,11,4],[18,3,18,4],[19,3,19,4],[20,3,20,4],[105,11,114,15],[78,2,78,4],[83,2,83,4],[56,2,56,3],[57,2,57,3],[58,2,58,3],[51,2,51,4],[86,6,86,9],[102,11,103,15],[51,5,51,6],[115,2,115,3],[115,5,115,10],[39,2,39,4],[42,2,42,3],[43,2,43,3],[32,2,32,4],[33,2,33,4],[34,2,34,4],[41,2,41,4],[40,2,40,4],[35,2,35,4],[36,2,36,4],[37,2,37,4],[44,5,44,6],[45,5,45,6],[46,5,46,6],[47,5,47,6],[48,5,48,6],[49,5,49,6],[66,2,66,4],[102,2,103,10],[77,2,77,4],[50,5,50,6],[105,2,114,10],[149,16,158,16],[127,2,136,10],[127,11,136,15],[127,16,136,16],[138,2,147,10],[138,11,147,15],[138,16,147,16],[137,2,137,3],[137,5,137,10],[137,11,137,12],[137,14,137,16],[148,2,148,3],[148,5,148,10],[148,11,148,12],[148,14,148,16],[149,2,158,10],[149,11,158,15],[126,11,126,12],[7,5,7,16],[8,5,8,16],[9,5,9,16],[10,5,10,16],[11,6,11,16],[12,5,12,16],[13,5,13,16],[14,5,14,16],[15,5,15,16],[126,14,126,16],[52,5,52,6],[42,5,42,6],[43,5,43,6],[105,16,114,16],[116,2,125,10],[116,11,125,15],[126,2,126,3],[126,5,126,10],[21,3,21,4],[22,3,22,4],[116,16,125,16],[104,2,104,3],[104,5,104,10],[15,17,15,19],[68,2,68,4],[70,2,70,9],[60,2,60,3],[61,2,61,3],[62,2,62,3],[63,2,63,3],[64,2,64,3],[69,6,69,10],[59,2,59,3],[49,2,49,3],[50,2,50,3],[52,2,52,4],[53,2,53,4],[54,2,54,4],[55,2,55,4],[65,2,65,3],[67,2,67,4],[38,2,38,4],[44,2,44,3],[45,2,45,3],[46,2,46,3],[47,2,47,3],[48,2,48,3]]}
[]
[]
[]
[null,null,null,null,null,null,null,null,null,null,null,null,"DEMANDE BUDGET AJU"]
[]
[]
[]
[null,null,{"$f":"'BUDGET INI APPROUVE'!C8","v":"Date de la demande :"},null,null,{"$f":"TODAY()","v":"2020-09-11"}]
[null,null,"Bénéficiaire : ",null,null,{"$f":"'BUDGET INI APPROUVE'!E9","v":0}]
[null,null,"Projet :",null,null,{"$f":"'BUDGET INI APPROUVE'!E10","v":0}]
[null,null,"Personne de contact",null,null,{"$f":"'BUDGET INI APPROUVE'!E11","v":0}]
[null,null,"Durée du projet (nombre de mois) :",null,null,{"$f":"'BUDGET INI APPROUVE'!E12","v":0},{"$f":"IF(OR(F12='BUDGET AJU APPROUVE'!E3:H40,F12>=13),\"Veuillez saisir une donnée correcte\",\" \")","v":"Veuillez saisir une donnée correcte"}]
[null,null,null,null,null,"INSTRUCTION"]
[null,null,null,null,null,"ATTENTION !Nous n'acceptons que les modification avec argumentation"]
[null,null,null,null,null,"lien argumentation"]
[null,null,null,null,null,"!!!!! Ne PAS REMPLIR les céllules en BLEUES !!!!",null,null,null,null,null,null,null,null,null,null,null,"RECONFIRMER"]
[null,null,{"$f":"'BUDGET INI APPROUVE'!C16","v":"Budget 2021"},null,null,"ETP","Coût unitaire (par mois)","Coût unitaire (par année)","Nombre de mois du projet","% de temps au projet","Montant total aju du projet","Demande budget aju Fedasil (projet ou activité)","% Fedasil","Autres sources de financement","% autres sources","Modification de Budget Fedasil (projet ou activité)","Total fincement AJU Fedasil","Montant total projet après modification","Total fincement Fedasil AJU","Autres sources de financement après modification"]
[null,null,"Personnel","lien vers argumentation",null,"(étape1)","(étape2)",null,"(étape3)","(étape4)",null,"(étape5)"]
[null,null,{"$f":"'BUDGET INI APPROUVE'!C18","v":"(nom à compléter)"},{"$f":"'BUDGET INI APPROUVE'!D18","v":"(fonction à compléter)"},null,{"$f":"'BUDGET INI APPROUVE'!E18","v":0},{"$f":"'BUDGET INI APPROUVE'!F18","v":0},{"$f":"'BUDGET INI APPROUVE'!G18","v":0},{"$f":"'BUDGET INI APPROUVE'!H18","v":0},{"$f":"'BUDGET INI APPROUVE'!I18","v":0},{"$f":"'BUDGET INI APPROUVE'!J18","v":0},{"$f":"'BUDGET INI APPROUVE'!K18","v":0},{"$f":"IFERROR(L19/K19,0)","v":0},{"$f":"'BUDGET INI APPROUVE'!M18","v":0},{"$f":"IFERROR(N19/K19,0)","v":0},0,{"$f":"IF(P19=0,L19,P19+L19)","v":0},{"$f":"K19+P19","v":0},{"$f":"Q19","v":0},{"$f":"R19-Q19","v":0}]
[null,null,{"$f":"'BUDGET INI APPROUVE'!C19","v":"(nom à compléter)"},{"$f":"'BUDGET INI APPROUVE'!D19","v":"(fonction à compléter)"},null,{"$f":"'BUDGET INI APPROUVE'!E19","v":0},{"$f":"'BUDGET INI APPROUVE'!F19","v":0},{"$f":"'BUDGET INI APPROUVE'!G19","v":0},{"$f":"'BUDGET INI APPROUVE'!H19","v":0},{"$f":"'BUDGET INI APPROUVE'!I19","v":0},{"$f":"'BUDGET INI APPROUVE'!J19","v":0},{"$f":"'BUDGET INI APPROUVE'!K19","v":0},{"$f":"IFERROR(L20/K20,0)","v":0},{"$f":"'BUDGET INI APPROUVE'!M19","v":0},{"$f":"IFERROR(N20/K20,0)","v":0},0,{"$f":"IF(P20=0,L20,P20+L20)","v":0},0,{"$f":"Q20","v":0},{"$f":"R20-Q20","v":0}]
[null,null,{"$f":"'BUDGET INI APPROUVE'!C20","v":"(nom à compléter)"},{"$f":"'BUDGET INI APPROUVE'!D20","v":"(fonction à compléter)"},null,{"$f":"'BUDGET INI APPROUVE'!E20","v":0},{"$f":"'BUDGET INI APPROUVE'!F20","v":0},{"$f":"'BUDGET INI APPROUVE'!G20","v":0},{"$f":"'BUDGET INI APPROUVE'!H20","v":0},{"$f":"'BUDGET INI APPROUVE'!I20","v":0},{"$f":"'BUDGET INI APPROUVE'!J20","v":0},{"$f":"'BUDGET INI APPROUVE'!K20","v":0},0,{"$f":"'BUDGET INI APPROUVE'!M20","v":0},0,0,0,0,0,0]
[null,null,{"$f":"'BUDGET INI APPROUVE'!C21","v":"(nom à compléter)"},{"$f":"'BUDGET INI APPROUVE'!D21","v":"(fonction à compléter)"},null,{"$f":"'BUDGET INI APPROUVE'!E21","v":0},{"$f":"'BUDGET INI APPROUVE'!F21","v":0},{"$f":"'BUDGET INI APPROUVE'!G21","v":0},{"$f":"'BUDGET INI APPROUVE'!H21","v":0},{"$f":"'BUDGET INI APPROUVE'!I21","v":0},{"$f":"'BUDGET INI APPROUVE'!J21","v":0},{"$f":"'BUDGET INI APPROUVE'!K21","v":0},0,{"$f":"'BUDGET INI APPROUVE'!M21","v":0},0,0,0,0,0,0]
[null,null,{"$f":"'BUDGET INI APPROUVE'!C22","v":"(nom à compléter)"},{"$f":"'BUDGET INI APPROUVE'!D22","v":"(fonction à compléter)"},null,{"$f":"'BUDGET INI APPROUVE'!E22","v":0},{"$f":"'BUDGET INI APPROUVE'!F22","v":0},{"$f":"'BUDGET INI APPROUVE'!G22","v":0},{"$f":"'BUDGET INI APPROUVE'!H22","v":0},{"$f":"'BUDGET INI APPROUVE'!I22","v":0},{"$f":"'BUDGET INI APPROUVE'!J22","v":0},{"$f":"'BUDGET INI APPROUVE'!K22","v":0},0,{"$f":"'BUDGET INI APPROUVE'!M22","v":0},0,0,0,0,0,0]
[null,null,{"$f":"'BUDGET INI APPROUVE'!C23","v":"(nom à compléter)"},{"$f":"'BUDGET INI APPROUVE'!D23","v":"(fonction à compléter)"},null,{"$f":"'BUDGET INI APPROUVE'!E23","v":0},{"$f":"'BUDGET INI APPROUVE'!F23","v":0},{"$f":"'BUDGET INI APPROUVE'!G23","v":0},{"$f":"'BUDGET INI APPROUVE'!H23","v":0},{"$f":"'BUDGET INI APPROUVE'!I23","v":0},{"$f":"'BUDGET INI APPROUVE'!J23","v":0},{"$f":"'BUDGET INI APPROUVE'!K23","v":0},0,{"$f":"'BUDGET INI APPROUVE'!M23","v":0},0,0,0,0,0,0]
[null,null,{"$f":"'BUDGET INI APPROUVE'!C24","v":"(nom à compléter)"},{"$f":"'BUDGET INI APPROUVE'!D24","v":"(fonction à compléter)"},null,{"$f":"'BUDGET INI APPROUVE'!E24","v":0},{"$f":"'BUDGET INI APPROUVE'!F24","v":0},{"$f":"'BUDGET INI APPROUVE'!G24","v":0},{"$f":"'BUDGET INI APPROUVE'!H24","v":0},{"$f":"'BUDGET INI APPROUVE'!I24","v":0},{"$f":"'BUDGET INI APPROUVE'!J24","v":0},{"$f":"'BUDGET INI APPROUVE'!K24","v":0},0,{"$f":"'BUDGET INI APPROUVE'!M24","v":0},0,0,0,0,0,0]
[null,null,{"$f":"'BUDGET INI APPROUVE'!C25","v":"(nom à compléter)"},{"$f":"'BUDGET INI APPROUVE'!D25","v":"(fonction à compléter)"},null,{"$f":"'BUDGET INI APPROUVE'!E25","v":0},{"$f":"'BUDGET INI APPROUVE'!F25","v":0},{"$f":"'BUDGET INI APPROUVE'!G25","v":0},{"$f":"'BUDGET INI APPROUVE'!H25","v":0},{"$f":"'BUDGET INI APPROUVE'!I25","v":0},{"$f":"'BUDGET INI APPROUVE'!J25","v":0},{"$f":"'BUDGET INI APPROUVE'!K25","v":0},0,{"$f":"'BUDGET INI APPROUVE'!M25","v":0},0,0,0,0,0,0]
[null,null,"Total",null,null,{"$f":"SUM(F19:F26)","v":0},null,{"$f":"SUM(H19:H26)","v":0},null,null,{"$f":"SUM(K19:K26)","v":0},{"$f":"SUM(L19:L26)","v":0},{"$f":"IF(K27=0,0,L27/K27)","v":0},{"$f":"SUM(N19:N26)","v":0},{"$f":"IF(K27=0,0,N27/K27)","v":0},{"$f":"SUM(P19:P26)","v":0},{"$f":"SUM(Q19:Q26)","v":0},{"$f":"SUM(R19:R26)","v":0},0,{"$f":"SUM(T19:T26)","v":0}]
[null,null,"Location","lien vers l'argumentation",null,null,null,null,null,null,null,null,null,null,null,0,{"$f":"P28-L28","v":0},null,0]
[null,null,{"$f":"'BUDGET INI APPROUVE'!C28","v":"(Objet/Bâtiment & Adresse à compléter)"},null,null,null,{"$f":"'BUDGET INI APPROUVE'!F28","v":0},{"$f":"'BUDGET INI APPROUVE'!G28","v":0},{"$f":"'BUDGET INI APPROUVE'!H28","v":0},{"$f":"'BUDGET INI APPROUVE'!I28","v":0},{"$f":"'BUDGET INI APPROUVE'!J28","v":0},{"$f":"'BUDGET INI APPROUVE'!K28","v":0},{"$f":"IFERROR(L29/K29,0)","v":0},{"$f":"'BUDGET INI APPROUVE'!M28","v":0},{"$f":"IFERROR(N29/K29,0)","v":0},0,{"$f":"IF(P29=0,L29,P29+L29)","v":0},{"$f":"K29+P29","v":0},0,{"$f":"R29-Q29","v":0}]
[null,null,{"$f":"'BUDGET INI APPROUVE'!C29","v":"(Objet/Bâtiment & Adresse à compléter)"},null,null,null,{"$f":"'BUDGET INI APPROUVE'!F29","v":0},{"$f":"'BUDGET INI APPROUVE'!G29","v":0},{"$f":"'BUDGET INI APPROUVE'!H29","v":0},{"$f":"'BUDGET INI APPROUVE'!I29","v":0},{"$f":"'BUDGET INI APPROUVE'!J29","v":0},{"$f":"'BUDGET INI APPROUVE'!K29","v":0},0,{"$f":"'BUDGET INI APPROUVE'!M29","v":0},0,0,0,0,0,0]
[null,null,{"$f":"'BUDGET INI APPROUVE'!C30","v":"(Objet/Bâtiment & Adresse à compléter)"},null,null,null,{"$f":"'BUDGET INI APPROUVE'!F30","v":0},{"$f":"'BUDGET INI APPROUVE'!G30","v":0},{"$f":"'BUDGET INI APPROUVE'!H30","v":0},{"$f":"'BUDGET INI APPROUVE'!I30","v":0},{"$f":"'BUDGET INI APPROUVE'!J30","v":0},{"$f":"'BUDGET INI APPROUVE'!K30","v":0},0,{"$f":"'BUDGET INI APPROUVE'!M30","v":0},0,0,0,0,0,0]
[null,null,{"$f":"'BUDGET INI APPROUVE'!C31","v":"(Objet/Bâtiment & Adresse à compléter)"},null,null,null,{"$f":"'BUDGET INI APPROUVE'!F31","v":0},{"$f":"'BUDGET INI APPROUVE'!G31","v":0},{"$f":"'BUDGET INI APPROUVE'!H31","v":0},{"$f":"'BUDGET INI APPROUVE'!I31","v":0},{"$f":"'BUDGET INI APPROUVE'!J31","v":0},{"$f":"'BUDGET INI APPROUVE'!K31","v":0},0,{"$f":"'BUDGET INI APPROUVE'!M31","v":0},0,0,{"$f":"IF(P32=0,L32,P32+L32)","v":0},0,0,0]
[null,null,"Total",null,null,null,null,{"$f":"SUM(H29:H32)","v":0},null,null,{"$f":"SUM(K29:K32)","v":0},{"$f":"SUM(L29:L32)","v":0},{"$f":"IF(K33=0,0,L33/K33)","v":0},{"$f":"SUM(N29:N32)","v":0},{"$f":"IF(K33=0,0,N33/K33)","v":0},{"$f":"SUM(P29:P32)","v":0},{"$f":"SUM(Q29:Q32)","v":0},{"$f":"SUM(R29:R32)","v":0},0,{"$f":"SUM(T29:T32)","v":0}]
[null,null,"Investissements (par ex. hardware/software)",null,null,null,null,null,null,null,null,null,null,null,null,null,null,null,0]
[null,null,"lien vers l'argumentation",null,null,null,null,null,null,null,null,null,null,null,null,null,null,null,0]
[null,null,{"$f":"'BUDGET INI APPROUVE'!C34","v":"(Compléter la description) "},null,null,null,null,{"$f":"'BUDGET INI APPROUVE'!G34","v":0},null,{"$f":"'BUDGET INI APPROUVE'!I34","v":0},{"$f":"'BUDGET INI APPROUVE'!J34","v":0},{"$f":"'BUDGET INI APPROUVE'!K34","v":0},{"$f":"IFERROR(L36/K36,0)","v":0},{"$f":"'BUDGET INI APPROUVE'!M34","v":0},{"$f":"IFERROR(N36/K36,0)","v":0},0,{"$f":"IF(P36=0,L36,P36+L36)","v":0},{"$f":"K36+P36","v":0},0,{"$f":"R36-Q36","v":0}]
[null,null,{"$f":"'BUDGET INI APPROUVE'!C35","v":"(à compléter) "},null,null,null,null,{"$f":"'BUDGET INI APPROUVE'!G35","v":0},null,{"$f":"'BUDGET INI APPROUVE'!I35","v":0},{"$f":"'BUDGET INI APPROUVE'!J35","v":0},{"$f":"'BUDGET INI APPROUVE'!K35","v":0},{"$f":"IFERROR(L37/K37,0)","v":0},{"$f":"'BUDGET INI APPROUVE'!M35","v":0},0,0,0,0,0,0]
[null,null,{"$f":"'BUDGET INI APPROUVE'!C36","v":"(à compléter) "},null,null,null,null,{"$f":"'BUDGET INI APPROUVE'!G36","v":0},null,{"$f":"'BUDGET INI APPROUVE'!I36","v":0},{"$f":"'BUDGET INI APPROUVE'!J36","v":0},{"$f":"'BUDGET INI APPROUVE'!K36","v":0},0,{"$f":"'BUDGET INI APPROUVE'!M36","v":0},0,0,0,0,0,0]
[null,null,{"$f":"'BUDGET INI APPROUVE'!C37","v":"(à compléter) "},null,null,null,null,{"$f":"'BUDGET INI APPROUVE'!G37","v":0},null,{"$f":"'BUDGET INI APPROUVE'!I37","v":0},{"$f":"'BUDGET INI APPROUVE'!J37","v":0},{"$f":"'BUDGET INI APPROUVE'!K37","v":0},0,{"$f":"'BUDGET INI APPROUVE'!M37","v":0},0,0,0,0,0,0]
[null,null,"Total",null,null,null,null,{"$f":"SUM(H36:H39)","v":0},null,null,{"$f":"SUM(K36:K39)","v":0},{"$f":"SUM(L36:L39)","v":0},{"$f":"IF(K40=0,0,L40/K40)","v":0},{"$f":"SUM(N36:N39)","v":0},{"$f":"IF(K40=0,0,N40/K40)","v":0},{"$f":"SUM(P36:P39)","v":0},{"$f":"SUM(Q36:Q39)","v":0},{"$f":"SUM(R36:R39)","v":0},0,{"$f":"SUM(T36:T39)","v":0}]
[null,null,"Frais de fonctionnement directs**",null,null,null,null,null,null,null,null,null,null,null,null,null,null,null,0]
[null,null,"lien vers l'argumentation",null,null,null,null,null,null,null,null,null,null,null,null,null,null,null,0]
[null,null,{"$f":"'BUDGET INI APPROUVE'!C40","v":"Choisissez dans la liste Frais de fonctionnement directs"},null,"\u0080",{"$f":"'BUDGET INI APPROUVE'!E40","v":" "},null,{"$f":"'BUDGET INI APPROUVE'!G40","v":0},null,null,{"$f":"'BUDGET INI APPROUVE'!J40","v":0},{"$f":"'BUDGET INI APPROUVE'!K40","v":0},{"$f":"IFERROR(L43/K43,0)","v":0},{"$f":"'BUDGET INI APPROUVE'!M40","v":0},{"$f":"IFERROR(N43/K43,0)","v":0},0,{"$f":"IF(P43=0,L43,P43+L43)","v":0},{"$f":"K43+P43","v":0},0,{"$f":"R43-Q43","v":0}]
[null,null,{"$f":"'BUDGET INI APPROUVE'!C41","v":"Choisissez dans la liste Frais de fonctionnement directs"},null,"\u0080",{"$f":"'BUDGET INI APPROUVE'!E41","v":" "},null,{"$f":"'BUDGET INI APPROUVE'!G41","v":0},null,null,{"$f":"'BUDGET INI APPROUVE'!J41","v":0},{"$f":"'BUDGET INI APPROUVE'!K41","v":0},{"$f":"IFERROR(L44/K44,0)","v":0},{"$f":"'BUDGET INI APPROUVE'!M41","v":0},0,0,0,0,0,0]
[null,null,{"$f":"'BUDGET INI APPROUVE'!C42","v":"Choisissez dans la liste Frais de fonctionnement directs"},null,"\u0080",{"$f":"'BUDGET INI APPROUVE'!E42","v":" "},null,{"$f":"'BUDGET INI APPROUVE'!G42","v":0},null,null,{"$f":"'BUDGET INI APPROUVE'!J42","v":0},{"$f":"'BUDGET INI APPROUVE'!K42","v":0},0,{"$f":"'BUDGET INI APPROUVE'!M42","v":0},0,0,0,0,0,0]
[null,null,{"$f":"'BUDGET INI APPROUVE'!C43","v":"Choisissez dans la liste Frais de fonctionnement directs"},null,"\u0080",{"$f":"'BUDGET INI APPROUVE'!E43","v":" "},null,{"$f":"'BUDGET INI APPROUVE'!G43","v":0},null,null,{"$f":"'BUDGET INI APPROUVE'!J43","v":0},{"$f":"'BUDGET INI APPROUVE'!K43","v":0},0,{"$f":"'BUDGET INI APPROUVE'!M43","v":0},0,0,0,0,0,0]
[null,null,{"$f":"'BUDGET INI APPROUVE'!C44","v":"Choisissez dans la liste Frais de fonctionnement directs"},null,"\u0080",{"$f":"'BUDGET INI APPROUVE'!E44","v":" "},null,{"$f":"'BUDGET INI APPROUVE'!G44","v":0},null,null,{"$f":"'BUDGET INI APPROUVE'!J44","v":0},{"$f":"'BUDGET INI APPROUVE'!K44","v":0},0,{"$f":"'BUDGET INI APPROUVE'!M44","v":0},0,0,0,{"$f":"K47+P47","v":0},0,0]
[null,null,{"$f":"'BUDGET INI APPROUVE'!C45","v":"Choisissez dans la liste Frais de fonctionnement directs"},null,"\u0080",{"$f":"'BUDGET INI APPROUVE'!E45","v":" "},null,{"$f":"'BUDGET INI APPROUVE'!G45","v":0},null,null,{"$f":"'BUDGET INI APPROUVE'!J45","v":0},{"$f":"'BUDGET INI APPROUVE'!K45","v":0},0,{"$f":"'BUDGET INI APPROUVE'!M45","v":0},0,0,0,0,0,0]
[null,null,{"$f":"'BUDGET INI APPROUVE'!C46","v":"Choisissez dans la liste Frais de fonctionnement directs"},null,"\u0080",{"$f":"'BUDGET INI APPROUVE'!E46","v":" "},null,{"$f":"'BUDGET INI APPROUVE'!G46","v":0},null,null,{"$f":"'BUDGET INI APPROUVE'!J46","v":0},{"$f":"'BUDGET INI APPROUVE'!K46","v":0},0,{"$f":"'BUDGET INI APPROUVE'!M46","v":0},0,0,0,0,0,0]
[null,null,{"$f":"'BUDGET INI APPROUVE'!C47","v":"Choisissez dans la liste Frais de fonctionnement directs"},null,"\u0080",{"$f":"'BUDGET INI APPROUVE'!E47","v":" "},null,{"$f":"'BUDGET INI APPROUVE'!G47","v":0},null,null,{"$f":"'BUDGET INI APPROUVE'!J47","v":0},{"$f":"'BUDGET INI APPROUVE'!K47","v":0},0,{"$f":"'BUDGET INI APPROUVE'!M47","v":0},0,0,0,0,0,0]
[null,null,{"$f":"'BUDGET INI APPROUVE'!C48","v":"Choisissez dans la liste Frais de fonctionnement directs"},null,"\u0080",{"$f":"'BUDGET INI APPROUVE'!E48","v":" "},null,{"$f":"'BUDGET INI APPROUVE'!G48","v":0},null,null,{"$f":"'BUDGET INI APPROUVE'!J48","v":0},{"$f":"'BUDGET INI APPROUVE'!K48","v":0},0,{"$f":"'BUDGET INI APPROUVE'!M48","v":0},0,0,0,0,0,0]
[null,null,{"$f":"'BUDGET INI APPROUVE'!C49","v":"Autre : (compléter soi-même)"},null,null,{"$f":"'BUDGET INI APPROUVE'!E49","v":" "},null,{"$f":"'BUDGET INI APPROUVE'!G49","v":0},null,null,{"$f":"'BUDGET INI APPROUVE'!J49","v":0},{"$f":"'BUDGET INI APPROUVE'!K49","v":0},{"$f":"IFERROR(L52/K52,0)","v":0},{"$f":"'BUDGET INI APPROUVE'!M49","v":0},0,0,0,0,0,0]
[null,null,{"$f":"'BUDGET INI APPROUVE'!C50","v":"Autre : (compléter soi-même)"},null,null,{"$f":"'BUDGET INI APPROUVE'!E50","v":" "},null,{"$f":"'BUDGET INI APPROUVE'!G50","v":0},null,null,{"$f":"'BUDGET INI APPROUVE'!J50","v":0},{"$f":"'BUDGET INI APPROUVE'!K50","v":0},0,{"$f":"'BUDGET INI APPROUVE'!M50","v":0},0,0,0,0,0,0]
[null,null,"Total",null,null,null,null,{"$f":"SUM(H43:H53)","v":0},null,null,{"$f":"SUM(K43:K53)","v":0},{"$f":"SUM(L43:L53)","v":0},{"$f":"IF(K54=0,0,L54/K54)","v":0},{"$f":"SUM(N43:N53)","v":0},0,{"$f":"SUM(P43:P53)","v":0},{"$f":"SUM(Q43:Q53)","v":0},{"$f":"SUM(R43:R53)","v":0},0,{"$f":"SUM(T43:T53)","v":0}]
[null,null,"Frais de fonctionnement indirects***",null,null,null,null,null,null,null,null,null,null,null,null,null,null,null,0]
[null,null,"lien vers l'argumentation",null,null,null,null,null,null,null,null,null,null,null,null,null,null,null,0]
[null,null,{"$f":"'BUDGET INI APPROUVE'!C53","v":"Choisissez dans la liste Frais de fonctionnement indirects"},null,"\u0080",null,null,{"$f":"'BUDGET INI APPROUVE'!G53","v":0},null,{"$f":"'BUDGET INI APPROUVE'!I53","v":0},{"$f":"'BUDGET INI APPROUVE'!J53","v":0},{"$f":"'BUDGET INI APPROUVE'!K53","v":0},{"$f":"IFERROR(L57/K57,0)","v":0},{"$f":"'BUDGET INI APPROUVE'!M53","v":0},{"$f":"IFERROR(N57/K57,0)","v":0},0,{"$f":"IF(P57=0,L57,P57+L57)","v":0},{"$f":"K57+P57","v":0},0,{"$f":"R57-Q57","v":0}]
[null,null,{"$f":"'BUDGET INI APPROUVE'!C54","v":"Choisissez dans la liste Frais de fonctionnement indirects"},null,"\u0080",null,null,{"$f":"'BUDGET INI APPROUVE'!G54","v":0},null,{"$f":"'BUDGET INI APPROUVE'!I54","v":0},{"$f":"'BUDGET INI APPROUVE'!J54","v":0},{"$f":"'BUDGET INI APPROUVE'!K54","v":0},{"$f":"IFERROR(L58/K58,0)","v":0},{"$f":"'BUDGET INI APPROUVE'!M54","v":0},0,0,0,0,0,0]
[null,null,{"$f":"'BUDGET INI APPROUVE'!C55","v":"Choisissez dans la liste Frais de fonctionnement indirects"},null,"\u0080",null,null,{"$f":"'BUDGET INI APPROUVE'!G55","v":0},null,{"$f":"'BUDGET INI APPROUVE'!I55","v":0},{"$f":"'BUDGET INI APPROUVE'!J55","v":0},{"$f":"'BUDGET INI APPROUVE'!K55","v":0},{"$f":"IFERROR(L59/K59,0)","v":0},{"$f":"'BUDGET INI APPROUVE'!M55","v":0},0,0,0,0,0,0]
[null,null,{"$f":"'BUDGET INI APPROUVE'!C56","v":"Choisissez dans la liste Frais de fonctionnement indirects"},null,"\u0080",null,null,{"$f":"'BUDGET INI APPROUVE'!G56","v":0},null,{"$f":"'BUDGET INI APPROUVE'!I56","v":0},{"$f":"'BUDGET INI APPROUVE'!J56","v":0},{"$f":"'BUDGET INI APPROUVE'!K56","v":0},0,{"$f":"'BUDGET INI APPROUVE'!M56","v":0},0,0,0,0,0,0]
[null,null,{"$f":"'BUDGET INI APPROUVE'!C57","v":"Choisissez dans la liste Frais de fonctionnement indirects"},null,"\u0080",null,null,{"$f":"'BUDGET INI APPROUVE'!G57","v":0},null,{"$f":"'BUDGET INI APPROUVE'!I57","v":0},{"$f":"'BUDGET INI APPROUVE'!J57","v":0},{"$f":"'BUDGET INI APPROUVE'!K57","v":0},0,{"$f":"'BUDGET INI APPROUVE'!M57","v":0},0,0,0,0,0,0]
[null,null,{"$f":"'BUDGET INI APPROUVE'!C58","v":"Choisissez dans la liste Frais de fonctionnement indirects"},null,"\u0080",null,null,{"$f":"'BUDGET INI APPROUVE'!G58","v":0},null,{"$f":"'BUDGET INI APPROUVE'!I58","v":0},{"$f":"'BUDGET INI APPROUVE'!J58","v":0},{"$f":"'BUDGET INI APPROUVE'!K58","v":0},0,{"$f":"'BUDGET INI APPROUVE'!M58","v":0},0,0,0,0,0,0]
[null,null,{"$f":"'BUDGET INI APPROUVE'!C59","v":"Choisissez dans la liste Frais de fonctionnement indirects"},null,"\u0080",null,null,{"$f":"'BUDGET INI APPROUVE'!G59","v":0},null,{"$f":"'BUDGET INI APPROUVE'!I59","v":0},{"$f":"'BUDGET INI APPROUVE'!J59","v":0},{"$f":"'BUDGET INI APPROUVE'!K59","v":0},0,{"$f":"'BUDGET INI APPROUVE'!M59","v":0},0,0,0,0,0,0]
[null,null,{"$f":"'BUDGET INI APPROUVE'!C60","v":"Choisissez dans la liste Frais de fonctionnement indirects"},null,"\u0080",null,null,{"$f":"'BUDGET INI APPROUVE'!G60","v":0},null,{"$f":"'BUDGET INI APPROUVE'!I60","v":0},{"$f":"'BUDGET INI APPROUVE'!J60","v":0},{"$f":"'BUDGET INI APPROUVE'!K60","v":0},0,{"$f":"'BUDGET INI APPROUVE'!M60","v":0},0,0,0,0,0,0]
[null,null,{"$f":"'BUDGET INI APPROUVE'!C61","v":"Choisissez dans la liste Frais de fonctionnement indirects"},null,"\u0080",null,null,{"$f":"'BUDGET INI APPROUVE'!G61","v":0},null,{"$f":"'BUDGET INI APPROUVE'!I61","v":0},{"$f":"'BUDGET INI APPROUVE'!J61","v":0},{"$f":"'BUDGET INI APPROUVE'!K61","v":0},0,{"$f":"'BUDGET INI APPROUVE'!M61","v":0},0,0,0,0,0,0]
[null,null,{"$f":"'BUDGET INI APPROUVE'!C62","v":"Choisissez dans la liste Frais de fonctionnement indirects"},null,"\u0080",null,null,{"$f":"'BUDGET INI APPROUVE'!G62","v":0},null,{"$f":"'BUDGET INI APPROUVE'!I62","v":0},{"$f":"'BUDGET INI APPROUVE'!J62","v":0},{"$f":"'BUDGET INI APPROUVE'!K62","v":0},0,{"$f":"'BUDGET INI APPROUVE'!M62","v":0},0,0,0,0,0,0]
[null,null,{"$f":"'BUDGET INI APPROUVE'!C63","v":"Autre : (compléter soi-même)"},null,null,null,null,{"$f":"'BUDGET INI APPROUVE'!G63","v":0},null,{"$f":"'BUDGET INI APPROUVE'!I63","v":0},{"$f":"'BUDGET INI APPROUVE'!J63","v":0},{"$f":"'BUDGET INI APPROUVE'!K63","v":0},{"$f":"IFERROR(L67/K67,0)","v":0},{"$f":"'BUDGET INI APPROUVE'!M63","v":0},{"$f":"IFERROR(N67/K67,0)","v":0},0,{"$f":"IF(P67=0,L67,P67+L67)","v":0},0,0,0]
[null,null,{"$f":"'BUDGET INI APPROUVE'!C64","v":"Autre : (compléter soi-même)"},null,null,null,null,{"$f":"'BUDGET INI APPROUVE'!G64","v":0},null,{"$f":"'BUDGET INI APPROUVE'!I64","v":0},{"$f":"'BUDGET INI APPROUVE'!J64","v":0},{"$f":"'BUDGET INI APPROUVE'!K64","v":0},0,{"$f":"'BUDGET INI APPROUVE'!M64","v":0},0,0,0,0,0,0]
[null,null,"Total",null,null,null,null,{"$f":"SUM(H57:H68)","v":0},null,null,{"$f":"SUM(K57:K68)","v":0},{"$f":"SUM(L57:L68)","v":0},{"$f":"IF(K69=0,0,L69/K69)","v":0},{"$f":"SUM(N57:N68)","v":0},{"$f":"IF(K69=0,0,N69/K69)","v":0},{"$f":"SUM(P57:P68)","v":0},{"$f":"SUM(Q57:Q68)","v":0},{"$f":"SUM(R57:R68)","v":0},0,{"$f":"SUM(T57:T68)","v":0}]
[null,null,null,null,null,null,"MAX DE FRAIS INDIRECTS ACCEPTES **** :",null,null,null,null,{"$f":"(L27+L33+L40+L54)/100*7","v":0},null,null,null,null,{"$f":"(Q27+Q33+Q40+Q54)/100*7","v":0},null,0]
[null,null,"TOTAL",null,null,null,null,null,null,null,{"$f":"K69+K54+K40+K33+K27","v":0},{"$f":"L69+L54+L40+L33+L27","v":0},0,{"$f":"N69+N54+N40+N33+N27","v":0},0,{"$f":"P69+P54+P40+P33+P27","v":0},{"$f":"Q69+Q54+Q40+Q33+Q27","v":0},{"$f":"R69+R54+R40+R33+R27","v":0},0,{"$f":"T69+T54+T40+T33+T27","v":0}]
[null,null,"* Si une partie ou l'entièreté de la subvention est utilisée comme co-financement, la répartition doit être indiquée ici.  Veuillez ajouter une colonne par projet. "]
[null,null,"** Frais de fonctionnement directs : Il s'agit de frais attribués de manière comptable au projet ou à l'activité. Si pas possible, ces frais peuvent être catégorisés comme 'frais de fonctionnement indirects'.   "]
[null,null,"*** Frais de fonctionnement indirects : Il s'agit de frais qui ne peuvent pas être entièrement attribués de manière comptable au projet ou à l'activité. Ces frais sont attribués via une clef de répartition. "]
[null,null,"La clef de répartition utilisée doit être déclarée dans le rapport relatif au contenu. "]
[null,null,"**** max de frais indirects autorisés avecles subsides de Fedasil :  7% de la somme du personnel, de la location, des investissements et des frais de fonctionnement directs"]
[]
[null,null,"Financement",null,null,null,"Détail Source de financement","Assurance",null,null,"Montant total du projet","Demande de subside Fedasil (projet ou activité)","% Fedasil","Autres sources de financement","% autres sources"]
[null,null,{"$f":"'BUDGET INI APPROUVE'!C75","v":"Fedasil"},null,null,null,null,{"$f":"'BUDGET INI APPROUVE'!G75","v":"Demandé"},null,null,{"$f":"L79","v":0},{"$f":"L71","v":0},{"$f":"IF($K$71=0,0,L79/$K$71)","v":0}]
[null,null,{"$f":"'BUDGET INI APPROUVE'!C76","v":"Moyens propres"},null,"\u0080",null,{"$f":"'BUDGET INI APPROUVE'!F76","v":"(à compléter)"},{"$f":"'BUDGET INI APPROUVE'!G76","v":"(à compléter)"},null,null,{"$f":"N80","v":0},null,null,{"$f":"'BUDGET INI APPROUVE'!M76","v":0},{"$f":"IF($K$71=0,0,N80/$K$71)","v":0}]
[null,null,{"$f":"'BUDGET INI APPROUVE'!C77","v":"Autre rentrées : (compléter soi-même)"},null,"\u0080",null,{"$f":"'BUDGET INI APPROUVE'!F77","v":"(à compléter)"},{"$f":"'BUDGET INI APPROUVE'!G77","v":"(à compléter)"},null,null,0,null,null,{"$f":"'BUDGET INI APPROUVE'!M77","v":0},0]
[null,null,{"$f":"'BUDGET INI APPROUVE'!C78","v":"Autre rentrées : (compléter soi-même)"},null,"\u0080",null,{"$f":"'BUDGET INI APPROUVE'!F78","v":"(à compléter)"},{"$f":"'BUDGET INI APPROUVE'!G78","v":"(à compléter)"},null,null,0,null,null,{"$f":"'BUDGET INI APPROUVE'!M78","v":0},0]
[null,null,{"$f":"'BUDGET INI APPROUVE'!C79","v":"Autre rentrées : (compléter soi-même)"},null,"\u0080",null,{"$f":"'BUDGET INI APPROUVE'!F79","v":"(à compléter)"},{"$f":"'BUDGET INI APPROUVE'!G79","v":"(à compléter)"},null,null,{"$f":"N83","v":0},null,null,{"$f":"'BUDGET INI APPROUVE'!M79","v":0},0]
[null,null,"Dons",null,null,null,{"$f":"'BUDGET INI APPROUVE'!F80","v":"(à compléter)"},{"$f":"'BUDGET INI APPROUVE'!G80","v":"(à compléter)"},null,null,0,null,null,{"$f":"'BUDGET INI APPROUVE'!M80","v":0},0]
[null,null,"TOTAL",null,null,null,null,null,null,null,{"$f":"SUM(K79:K84)","v":0},{"$f":"SUM(L79:L84)","v":0},{"$f":"IF($K$71=0,0,L85/$K$71)","v":0},{"$f":"SUM(N80:N84)","v":0},{"$f":"IF($K$71=0,0,N85/$K$71)","v":0}]
[]
[null,null,null,null,null,null,"DIFFERENCE ENTRE BUDGET ET FINANCEMENT",null,null,null,{"$f":"K71-K85","v":0},null,null,{"$f":"N71-N85","v":0}]
[]
[]
[]
[]
[]
[]
[]
[]
[]
[]
[]
[]
[]
[]
[]
[null,null,"ARGUMENTATION MODIFICATION DU BUDGET",null,null,null,null,null,null,null,null,"EVALUATION MODIFICATION DU BUDGET FEDASIL",null,null,null,null,"OK ?"]
[]
[null,null,"FRAIS DE PERSONNEL",null,null,"RETOUR EN HAUT"]
[]
[]
[]
[]
[]
[]
[]
[]
[]
[]
[null,null,"LOCATION",null,null,"RETOUR EN HAUT"]
[]
[]
[]
[]
[]
[]
[]
[]
[]
[]
[null,null,"INVESTISSEMENTS",null,null,"RETOUR EN HAUT"]
[]
[]
[]
[]
[]
[]
[]
[]
[]
[]
[null,null,"FRAIS DE FONCTIONNEMENT DIRECTS",null,null,"RETOUR EN HAUT"]
[]
[]
[]
[]
[]
[]
[]
[]
[]
[]
[null,null,"FRAIS DE FONCTIONNEMENT INDIRECTS",null,null,"RETOUR EN HAUT"]

{"sheet":"BUDGET AJU APPROUVE","index":8,"n_rows":80,"n_cols":14,"rows_kept":80,"cut":false,"hidden":true,"merged":[[2,8,3,9],[3,11,3,13],[7,4,7,13],[2,4,3,7],[79,5,79,8],[8,4,8,13],[9,4,9,13],[11,4,11,13],[10,4,10,13],[36,4,36,5],[37,4,37,5],[38,4,38,5],[39,4,39,5],[40,4,40,5],[41,4,41,5],[42,4,42,5],[43,4,43,5],[44,4,44,5],[45,4,45,5],[46,4,46,5],[13,2,13,3],[23,2,23,3],[22,2,22,3],[28,2,28,3],[34,2,34,3],[30,2,30,3],[24,2,24,3],[25,2,25,3],[26,2,26,3],[27,2,27,3],[29,2,29,3],[40,2,40,3],[31,2,31,3],[7,2,7,3],[12,2,12,3],[8,2,8,3],[9,2,9,3],[10,2,10,3],[11,2,11,3],[32,2,32,3],[33,2,33,3],[35,2,35,3],[36,2,36,3],[37,2,37,3],[38,2,38,3],[39,2,39,3],[41,2,41,3],[42,2,42,3],[43,2,43,3],[44,2,44,3],[45,2,45,3],[46,2,46,3],[48,2,48,3],[49,2,49,3],[50,2,50,3],[47,2,47,3],[51,2,51,3],[52,2,52,3],[53,2,53,3],[54,2,54,3],[55,2,55,3],[56,2,56,3],[57,2,57,3],[58,2,58,3],[60,2,60,3],[63,2,63,8],[61,2,61,3],[59,2,59,3],[62,5,62,9]]}
[]
[]
[null,null,null,null,"BUDGET AJU APPROUVE",null,null,null,"2021/XX"]
[null,null,null,null,null,null,null,null,null,null,null,"BUDGET AJU APPROUVE"]
[]
[]
[]
[null,null,{"$f":"'DEMANDE BUDGET AJU'!C8","v":"Date de la demande :"},null,{"$f":"'DEMANDE BUDGET AJU'!F8","v":"2020-09-11"}]
[null,null,"Bénéficiaire : ",null,{"$f":"'DEMANDE BUDGET AJU'!F9","v":0}]
[null,null,"Projet :",null,{"$f":"'DEMANDE BUDGET AJU'!F10","v":0}]
[null,null,"Personne de contact",null,{"$f":"'DEMANDE BUDGET AJU'!F11","v":0}]
[null,null,"Durée du projet (nombre de mois) :",null,{"$f":"'DEMANDE BUDGET AJU'!F12","v":0}]
[null,null,{"$f":"'DEMANDE BUDGET AJU'!C17","v":"Budget 2021"},null,"ETP","Coût unitaire (par mois)","Coût unitaire (par année)","Nombre de mois du projet","% de temps au projet","Montant total du projet","Budget aju Fedasil  Approuvé (projet ou activité)","% Fedasil","Autres sources de financement","% autres sources"]
[null,null,"Personnel",null,"(étape1)","(étape2)",null,"(étape3)","(étape4)",null,"(étape5)"]
[null,null,{"$f":"'DEMANDE BUDGET AJU'!C19","v":"(nom à compléter)"},{"$f":"'DEMANDE BUDGET AJU'!D19","v":"(fonction à compléter)"},{"$f":"'DEMANDE BUDGET AJU'!F19","v":0},{"$f":"'DEMANDE BUDGET AJU'!G19","v":0},{"$f":"F15*12","v":0},{"$f":"'DEMANDE BUDGET AJU'!I19","v":0},{"$f":"'DEMANDE BUDGET AJU'!J19","v":0},{"$f":"'DEMANDE BUDGET AJU'!R19","v":0},{"$f":"('DEMANDE BUDGET AJU'!Q19)","v":0},{"$f":"IF('DEMANDE BUDGET AJU'!P19=0,'DEMANDE BUDGET AJU'!M19,K15/J15)","v":0},{"$f":"J15-K15","v":0},{"$f":"IF(J15=0,0,M15/J15)","v":0}]
[null,null,{"$f":"'DEMANDE BUDGET AJU'!C20","v":"(nom à compléter)"},{"$f":"'DEMANDE BUDGET AJU'!D20","v":"(fonction à compléter)"},{"$f":"'DEMANDE BUDGET AJU'!F20","v":0},{"$f":"'DEMANDE BUDGET AJU'!G20","v":0},{"$f":"F16*12","v":0},{"$f":"'DEMANDE BUDGET AJU'!I20","v":0},{"$f":"'DEMANDE BUDGET AJU'!J20","v":0},{"$f":"'DEMANDE BUDGET AJU'!R20","v":0},{"$f":"('DEMANDE BUDGET AJU'!Q20)","v":0},{"$f":"IF('DEMANDE BUDGET AJU'!P20=0,'DEMANDE BUDGET AJU'!M20,K16/J16)","v":0},{"$f":"J16-K16","v":0},{"$f":"IF(J16=0,0,M16/J16)","v":0}]
[null,null,{"$f":"'DEMANDE BUDGET AJU'!C21","v":"(nom à compléter)"},{"$f":"'DEMANDE BUDGET AJU'!D21","v":"(fonction à compléter)"},{"$f":"'DEMANDE BUDGET AJU'!F21","v":0},{"$f":"'DEMANDE BUDGET AJU'!G21","v":0},0,{"$f":"'DEMANDE BUDGET AJU'!I21","v":0},{"$f":"'DEMANDE BUDGET AJU'!J21","v":0},{"$f":"'DEMANDE BUDGET AJU'!R21","v":0},{"$f":"('DEMANDE BUDGET AJU'!Q21)","v":0},{"$f":"IF('DEMANDE BUDGET AJU'!P21=0,'DEMANDE BUDGET AJU'!M21,K17/J17)","v":0},0,{"$f":"IF(J17=0,0,M17/J17)","v":0}]
[null,null,{"$f":"'DEMANDE BUDGET AJU'!C22","v":"(nom à compléter)"},{"$f":"'DEMANDE BUDGET AJU'!D22","v":"(fonction à compléter)"},{"$f":"'DEMANDE BUDGET AJU'!F22","v":0},{"$f":"'DEMANDE BUDGET AJU'!G22","v":0},0,{"$f":"'DEMANDE BUDGET AJU'!I22","v":0},{"$f":"'DEMANDE BUDGET AJU'!J22","v":0},{"$f":"'DEMANDE BUDGET AJU'!R22","v":0},{"$f":"('DEMANDE BUDGET AJU'!Q22)","v":0},{"$f":"IF('DEMANDE BUDGET AJU'!P22=0,'DEMANDE BUDGET AJU'!M22,K18/J18)","v":0},0,0]
[null,null,{"$f":"'DEMANDE BUDGET AJU'!C23","v":"(nom à compléter)"},{"$f":"'DEMANDE BUDGET AJU'!D23","v":"(fonction à compléter)"},{"$f":"'DEMANDE BUDGET AJU'!F23","v":0},{"$f":"'DEMANDE BUDGET AJU'!G23","v":0},0,{"$f":"'DEMANDE BUDGET AJU'!I23","v":0},{"$f":"'DEMANDE BUDGET AJU'!J23","v":0},{"$f":"'DEMANDE BUDGET AJU'!R23","v":0},{"$f":"('DEMANDE BUDGET AJU'!Q23)","v":0},{"$f":"IF('DEMANDE BUDGET AJU'!P23=0,'DEMANDE BUDGET AJU'!M23,K19/J19)","v":0},0,0]
[null,null,{"$f":"'DEMANDE BUDGET AJU'!C24","v":"(nom à compléter)"},{"$f":"'DEMANDE BUDGET AJU'!D24","v":"(fonction à compléter)"},{"$f":"'DEMANDE BUDGET AJU'!F24","v":0},{"$f":"'DEMANDE BUDGET AJU'!G24","v":0},0,{"$f":"'DEMANDE BUDGET AJU'!I24","v":0},{"$f":"'DEMANDE BUDGET AJU'!J24","v":0},{"$f":"'DEMANDE BUDGET AJU'!R24","v":0},{"$f":"('DEMANDE BUDGET AJU'!Q24)","v":0},{"$f":"IF('DEMANDE BUDGET AJU'!P24=0,'DEMANDE BUDGET AJU'!M24,K20/J20)","v":0},0,0]
[null,null,{"$f":"'DEMANDE BUDGET AJU'!C25","v":"(nom à compléter)"},{"$f":"'DEMANDE BUDGET AJU'!D25","v":"(fonction à compléter)"},{"$f":"'DEMANDE BUDGET AJU'!F25","v":0},{"$f":"'DEMANDE BUDGET AJU'!G25","v":0},0,{"$f":"'DEMANDE BUDGET AJU'!I25","v":0},{"$f":"'DEMANDE BUDGET AJU'!J25","v":0},{"$f":"'DEMANDE BUDGET AJU'!R25","v":0},{"$f":"('DEMANDE BUDGET AJU'!Q25)","v":0},{"$f":"IF('DEMANDE BUDGET AJU'!P25=0,'DEMANDE BUDGET AJU'!M25,K21/J21)","v":0},0,0]
[null,null,{"$f":"'DEMANDE BUDGET AJU'!C26","v":"(nom à compléter)"},{"$f":"'DEMANDE BUDGET AJU'!D26","v":"(fonction à compléter)"},{"$f":"'DEMANDE BUDGET AJU'!F26","v":0},{"$f":"'DEMANDE BUDGET AJU'!G26","v":0},{"$f":"F22*12","v":0},{"$f":"'DEMANDE BUDGET AJU'!I26","v":0},{"$f":"'DEMANDE BUDGET AJU'!J26","v":0},{"$f":"'DEMANDE BUDGET AJU'!R26","v":0},{"$f":"('DEMANDE BUDGET AJU'!Q26)","v":0},{"$f":"IF('DEMANDE BUDGET AJU'!P26=0,'DEMANDE BUDGET AJU'!M26,K22/J22)","v":0},0,0]
[null,null,"Total",null,{"$f":"SUM(E15:E22)","v":0},null,{"$f":"SUM(G15:G22)","v":0},null,null,{"$f":"SUM(J15:J22)","v":0},{"$f":"SUM(K15:K22)","v":0},{"$f":"IF(J23=0,0,K23/J23)","v":0},{"$f":"SUM(M15:M22)","v":0},{"$f":"IF(J23=0,0,M23/J23)","v":0}]
[null,null,"Location"]
[null,null,{"$f":"'DEMANDE BUDGET AJU'!C29","v":"(Objet/Bâtiment & Adresse à compléter)"},null,null,{"$f":"'DEMANDE BUDGET AJU'!G29","v":0},{"$f":"+F25*12","v":0},{"$f":"'DEMANDE BUDGET AJU'!I29","v":0},{"$f":"'DEMANDE BUDGET AJU'!J29","v":0},{"$f":"'DEMANDE BUDGET AJU'!R29","v":0},{"$f":"'DEMANDE BUDGET AJU'!Q29","v":0},{"$f":"IF('DEMANDE BUDGET AJU'!P29=0,'DEMANDE BUDGET AJU'!M29,K25/J25)","v":0},{"$f":"J25-K25","v":0},0]
[null,null,{"$f":"'DEMANDE BUDGET AJU'!C30","v":"(Objet/Bâtiment & Adresse à compléter)"},null,null,{"$f":"'DEMANDE BUDGET AJU'!G30","v":0},{"$f":"+F26*12","v":0},{"$f":"'DEMANDE BUDGET AJU'!I30","v":0},{"$f":"'DEMANDE BUDGET AJU'!J30","v":0},{"$f":"'DEMANDE BUDGET AJU'!R30","v":0},{"$f":"'DEMANDE BUDGET AJU'!Q30","v":0},{"$f":"IF('DEMANDE BUDGET AJU'!P30=0,'DEMANDE BUDGET AJU'!M30,K26/J26)","v":0},{"$f":"J26-K26","v":0},0]
[null,null,{"$f":"'DEMANDE BUDGET AJU'!C31","v":"(Objet/Bâtiment & Adresse à compléter)"},null,null,{"$f":"'DEMANDE BUDGET AJU'!G31","v":0},{"$f":"+F27*12","v":0},{"$f":"'DEMANDE BUDGET AJU'!I31","v":0},{"$f":"'DEMANDE BUDGET AJU'!J31","v":0},{"$f":"'DEMANDE BUDGET AJU'!R31","v":0},{"$f":"'DEMANDE BUDGET AJU'!Q31","v":0},{"$f":"IF('DEMANDE BUDGET AJU'!P31=0,'DEMANDE BUDGET AJU'!M31,K27/J27)","v":0},{"$f":"J27-K27","v":0},0]
[null,null,{"$f":"'DEMANDE BUDGET AJU'!C32","v":"(Objet/Bâtiment & Adresse à compléter)"},null,null,{"$f":"'DEMANDE BUDGET AJU'!G32","v":0},{"$f":"+F28*12","v":0},{"$f":"'DEMANDE BUDGET AJU'!I32","v":0},{"$f":"'DEMANDE BUDGET AJU'!J32","v":0},{"$f":"'DEMANDE BUDGET AJU'!R32","v":0},{"$f":"'DEMANDE BUDGET AJU'!Q32","v":0},{"$f":"IF('DEMANDE BUDGET AJU'!P32=0,'DEMANDE BUDGET AJU'!M32,K28/J28)","v":0},{"$f":"J28-K28","v":0},0]
[null,null,"Total",null,null,null,{"$f":"SUM(G25:G28)","v":0},null,null,{"$f":"SUM(J25:J28)","v":0},{"$f":"SUM(K25:K28)","v":0},{"$f":"IF(J29=0,0,K29/J29)","v":0},{"$f":"SUM(M25:M28)","v":0},{"$f":"IF(J29=0,0,M29/J29)","v":0}]
[null,null,"Investissements (ex. hardware et/ou software) "]
[null,null,{"$f":"'DEMANDE BUDGET AJU'!C36","v":"(Compléter la description) "},null,null,null,{"$f":"'DEMANDE BUDGET AJU'!H36","v":0},null,{"$f":"'DEMANDE BUDGET AJU'!J36","v":0},{"$f":"'DEMANDE BUDGET AJU'!R36","v":0},{"$f":"'DEMANDE BUDGET AJU'!Q36","v":0},{"$f":"IF('DEMANDE BUDGET AJU'!P36=0,'DEMANDE BUDGET AJU'!M36,K31/J31)","v":0},{"$f":"J31-K31","v":0},0]
[null,null,{"$f":"'DEMANDE BUDGET AJU'!C37","v":"(à compléter) "},null,null,null,{"$f":"'DEMANDE BUDGET AJU'!H37","v":0},null,{"$f":"'DEMANDE BUDGET AJU'!J37","v":0},{"$f":"'DEMANDE BUDGET AJU'!R37","v":0},{"$f":"'DEMANDE BUDGET AJU'!Q37","v":0},{"$f":"IF('DEMANDE BUDGET AJU'!P37=0,'DEMANDE BUDGET AJU'!M37,K32/J32)","v":0},{"$f":"J32-K32","v":0},0]
[null,null,{"$f":"'DEMANDE BUDGET AJU'!C38","v":"(à compléter) "},null,null,null,{"$f":"'DEMANDE BUDGET AJU'!H38","v":0},null,{"$f":"'DEMANDE BUDGET AJU'!J38","v":0},{"$f":"'DEMANDE BUDGET AJU'!R38","v":0},{"$f":"'DEMANDE BUDGET AJU'!Q38","v":0},{"$f":"IF('DEMANDE BUDGET AJU'!P38=0,'DEMANDE BUDGET AJU'!M38,K33/J33)","v":0},{"$f":"J33-K33","v":0},0]
[null,null,{"$f":"'DEMANDE BUDGET AJU'!C39","v":"(à compléter) "},null,null,null,{"$f":"'DEMANDE BUDGET AJU'!H39","v":0},null,{"$f":"'DEMANDE BUDGET AJU'!J39","v":0},{"$f":"'DEMANDE BUDGET AJU'!R39","v":0},{"$f":"'DEMANDE BUDGET AJU'!Q39","v":0},{"$f":"IF('DEMANDE BUDGET AJU'!P39=0,'DEMANDE BUDGET AJU'!M39,K34/J34)","v":0},{"$f":"J34-K34","v":0},0]
[null,null,"Total",null,null,null,{"$f":"SUM(G31:G34)","v":0},null,null,{"$f":"SUM(J31:J34)","v":0},{"$f":"SUM(K31:K34)","v":0},{"$f":"IF(J35=0,0,K35/J35)","v":0},{"$f":"SUM(M31:M34)","v":0},0]
[null,null,"Frais de fonctionnement directs**"]
[null,null,{"$f":"'DEMANDE BUDGET AJU'!C43","v":"Choisissez dans la liste Frais de fonctionnement directs"},null,{"$f":"'DEMANDE BUDGET AJU'!F43","v":" "},null,{"$f":"'DEMANDE BUDGET AJU'!H43","v":0},null,null,{"$f":"'DEMANDE BUDGET AJU'!R43","v":0},{"$f":"'DEMANDE BUDGET AJU'!Q43","v":0},0,{"$f":"J37-K37","v":0},0]
[null,null,{"$f":"'DEMANDE BUDGET AJU'!C44","v":"Choisissez dans la liste Frais de fonctionnement directs"},null,{"$f":"'DEMANDE BUDGET AJU'!F44","v":" "},null,{"$f":"'DEMANDE BUDGET AJU'!H44","v":0},null,null,{"$f":"'DEMANDE BUDGET AJU'!R44","v":0},{"$f":"'DEMANDE BUDGET AJU'!Q44","v":0},0,{"$f":"J38-K38","v":0},0]
[null,null,{"$f":"'DEMANDE BUDGET AJU'!C45","v":"Choisissez dans la liste Frais de fonctionnement directs"},null,{"$f":"'DEMANDE BUDGET AJU'!F45","v":" "},null,{"$f":"'DEMANDE BUDGET AJU'!H45","v":0},null,null,{"$f":"'DEMANDE BUDGET AJU'!R45","v":0},{"$f":"'DEMANDE BUDGET AJU'!Q45","v":0},0,0,0]
[null,null,{"$f":"'DEMANDE BUDGET AJU'!C46","v":"Choisissez dans la liste Frais de fonctionnement directs"},null,{"$f":"'DEMANDE BUDGET AJU'!F46","v":" "},null,{"$f":"'DEMANDE BUDGET AJU'!H46","v":0},null,null,{"$f":"'DEMANDE BUDGET AJU'!R46","v":0},{"$f":"'DEMANDE BUDGET AJU'!Q46","v":0},0,0,0]
[null,null,{"$f":"'DEMANDE BUDGET AJU'!C47","v":"Choisissez dans la liste Frais de fonctionnement directs"},null,{"$f":"'DEMANDE BUDGET AJU'!F47","v":" "},null,{"$f":"'DEMANDE BUDGET AJU'!H47","v":0},null,null,{"$f":"'DEMANDE BUDGET AJU'!R47","v":0},{"$f":"'DEMANDE BUDGET AJU'!Q47","v":0},0,0,0]
[null,null,{"$f":"'DEMANDE BUDGET AJU'!C48","v":"Choisissez dans la liste Frais de fonctionnement directs"},null,{"$f":"'DEMANDE BUDGET AJU'!F48","v":" "},null,{"$f":"'DEMANDE BUDGET AJU'!H48","v":0},null,null,{"$f":"'DEMANDE BUDGET AJU'!R48","v":0},{"$f":"'DEMANDE BUDGET AJU'!Q48","v":0},0,{"$f":"J42-K42","v":0},0]
[null,null,{"$f":"'DEMANDE BUDGET AJU'!C49","v":"Choisissez dans la liste Frais de fonctionnement directs"},null,{"$f":"'DEMANDE BUDGET AJU'!F49","v":" "},null,{"$f":"'DEMANDE BUDGET AJU'!H49","v":0},null,null,{"$f":"'DEMANDE BUDGET AJU'!R49","v":0},{"$f":"'DEMANDE BUDGET AJU'!Q49","v":0},0,{"$f":"J43-K43","v":0},0]
[null,null,{"$f":"'DEMANDE BUDGET AJU'!C50","v":"Choisissez dans la liste Frais de fonctionnement directs"},null,{"$f":"'DEMANDE BUDGET AJU'!F50","v":" "},null,{"$f":"'DEMANDE BUDGET AJU'!H50","v":0},null,null,{"$f":"'DEMANDE BUDGET AJU'!R50","v":0},{"$f":"'DEMANDE BUDGET AJU'!Q50","v":0},0,{"$f":"J44-K44","v":0},0]
[null,null,{"$f":"'DEMANDE BUDGET AJU'!C51","v":"Choisissez dans la liste Frais de fonctionnement directs"},null,{"$f":"'DEMANDE BUDGET AJU'!F51","v":" "},null,{"$f":"'DEMANDE BUDGET AJU'!H51","v":0},null,null,{"$f":"'DEMANDE BUDGET AJU'!R51","v":0},{"$f":"'DEMANDE BUDGET AJU'!Q51","v":0},0,{"$f":"J45-K45","v":0},0]
[null,null,{"$f":"'DEMANDE BUDGET AJU'!C52","v":"Autre : (compléter soi-même)"},null,{"$f":"'DEMANDE BUDGET AJU'!F52","v":" "},null,{"$f":"'DEMANDE BUDGET AJU'!H52","v":0},null,null,{"$f":"'DEMANDE BUDGET AJU'!R52","v":0},{"$f":"'DEMANDE BUDGET AJU'!Q52","v":0},{"$f":"IF(J46=0,0,K46/J46)","v":0},{"$f":"J46-K46","v":0},{"$f":"IF(J46=0,0,M46/J46)","v":0}]
[null,null,{"$f":"'DEMANDE BUDGET AJU'!C53","v":"Autre : (compléter soi-même)"},null,{"$f":"'DEMANDE BUDGET AJU'!F53","v":" "},null,{"$f":"'DEMANDE BUDGET AJU'!H53","v":0},null,null,{"$f":"'DEMANDE BUDGET AJU'!R53","v":0},{"$f":"'DEMANDE BUDGET AJU'!Q53","v":0},0,0,0]
[null,null,"Total ",null,null,null,{"$f":"SUM(G37:G47)","v":0},null,null,{"$f":"SUM(J37:J47)","v":0},{"$f":"SUM(K37:K47)","v":0},{"$f":"IF(J48=0,0,K48/J48)","v":0},{"$f":"SUM(M37:M47)","v":0},0]
[null,null,"Frais de fonctionnement indirect***"]
[null,null,{"$f":"'DEMANDE BUDGET AJU'!C57","v":"Choisissez dans la liste Frais de fonctionnement indirects"},null,null,null,{"$f":"'DEMANDE BUDGET AJU'!H57","v":0},null,{"$f":"'DEMANDE BUDGET AJU'!J57","v":0},{"$f":"'DEMANDE BUDGET AJU'!R57","v":0},{"$f":"'DEMANDE BUDGET AJU'!Q57","v":0},{"$f":"IF('DEMANDE BUDGET AJU'!P57=0,'DEMANDE BUDGET AJU'!M57,K50/J50)","v":0},{"$f":"J50-K50","v":0},0]
[null,null,{"$f":"'DEMANDE BUDGET AJU'!C58","v":"Choisissez dans la liste Frais de fonctionnement indirects"},null,null,null,{"$f":"'DEMANDE BUDGET AJU'!H58","v":0},null,{"$f":"'DEMANDE BUDGET AJU'!J58","v":0},{"$f":"'DEMANDE BUDGET AJU'!R58","v":0},{"$f":"'DEMANDE BUDGET AJU'!Q58","v":0},{"$f":"IF('DEMANDE BUDGET AJU'!P58=0,'DEMANDE BUDGET AJU'!M58,K51/J51)","v":0},{"$f":"J51-K51","v":0},0]
[null,null,{"$f":"'DEMANDE BUDGET AJU'!C59","v":"Choisissez dans la liste Frais de fonctionnement indirects"},null,null,null,{"$f":"'DEMANDE BUDGET AJU'!H59","v":0},null,{"$f":"'DEMANDE BUDGET AJU'!J59","v":0},{"$f":"'DEMANDE BUDGET AJU'!R59","v":0},{"$f":"'DEMANDE BUDGET AJU'!Q59","v":0},{"$f":"IF('DEMANDE BUDGET AJU'!P59=0,'DEMANDE BUDGET AJU'!M59,K52/J52)","v":0},0,0]
[null,null,{"$f":"'DEMANDE BUDGET AJU'!C60","v":"Choisissez dans la liste Frais de fonctionnement indirects"},null,null,null,{"$f":"'DEMANDE BUDGET AJU'!H60","v":0},null,{"$f":"'DEMANDE BUDGET AJU'!J60","v":0},{"$f":"'DEMANDE BUDGET AJU'!R60","v":0},{"$f":"'DEMANDE BUDGET AJU'!Q60","v":0},{"$f":"IF('DEMANDE BUDGET AJU'!P60=0,'DEMANDE BUDGET AJU'!M60,K53/J53)","v":0},0,0]
[null,null,{"$f":"'DEMANDE BUDGET AJU'!C61","v":"Choisissez dans la liste Frais de fonctionnement indirects"},null,null,null,{"$f":"'DEMANDE BUDGET AJU'!H61","v":0},null,{"$f":"'DEMANDE BUDGET AJU'!J61","v":0},{"$f":"'DEMANDE BUDGET AJU'!R61","v":0},{"$f":"'DEMANDE BUDGET AJU'!Q61","v":0},{"$f":"IF('DEMANDE BUDGET AJU'!P61=0,'DEMANDE BUDGET AJU'!M61,K54/J54)","v":0},{"$f":"J54-K54","v":0},0]
[null,null,{"$f":"'DEMANDE BUDGET AJU'!C62","v":"Choisissez dans la liste Frais de fonctionnement indirects"},null,null,null,{"$f":"'DEMANDE BUDGET AJU'!H62","v":0},null,{"$f":"'DEMANDE BUDGET AJU'!J62","v":0},{"$f":"'DEMANDE BUDGET AJU'!R62","v":0},{"$f":"'DEMANDE BUDGET AJU'!Q62","v":0},{"$f":"IF('DEMANDE BUDGET AJU'!P62=0,'DEMANDE BUDGET AJU'!M62,K55/J55)","v":0},{"$f":"J55-K55","v":0},0]
[null,null,{"$f":"'DEMANDE BUDGET AJU'!C63","v":"Choisissez dans la liste Frais de fonctionnement indirects"},null,null,null,{"$f":"'DEMANDE BUDGET AJU'!H63","v":0},null,{"$f":"'DEMANDE BUDGET AJU'!J63","v":0},{"$f":"'DEMANDE BUDGET AJU'!R63","v":0},{"$f":"'DEMANDE BUDGET AJU'!Q63","v":0},{"$f":"IF('DEMANDE BUDGET AJU'!P63=0,'DEMANDE BUDGET AJU'!M63,K56/J56)","v":0},0,0]
[null,null,{"$f":"'DEMANDE BUDGET AJU'!C64","v":"Choisissez dans la liste Frais de fonctionnement indirects"},null,null,null,{"$f":"'DEMANDE BUDGET AJU'!H64","v":0},null,{"$f":"'DEMANDE BUDGET AJU'!J64","v":0},{"$f":"'DEMANDE BUDGET AJU'!R64","v":0},{"$f":"'DEMANDE BUDGET AJU'!Q64","v":0},{"$f":"IF('DEMANDE BUDGET AJU'!P64=0,'DEMANDE BUDGET AJU'!M64,K57/J57)","v":0},0,0]
[null,null,{"$f":"'DEMANDE BUDGET AJU'!C65","v":"Choisissez dans la liste Frais de fonctionnement indirects"},null,null,null,{"$f":"'DEMANDE BUDGET AJU'!H65","v":0},null,{"$f":"'DEMANDE BUDGET AJU'!J65","v":0},{"$f":"'DEMANDE BUDGET AJU'!R65","v":0},{"$f":"'DEMANDE BUDGET AJU'!Q65","v":0},{"$f":"IF('DEMANDE BUDGET AJU'!P65=0,'DEMANDE BUDGET AJU'!M65,K58/J58)","v":0},0,0]
[null,null,{"$f":"'DEMANDE BUDGET AJU'!C66","v":"Choisissez dans la liste Frais de fonctionnement indirects"},null,null,null,{"$f":"'DEMANDE BUDGET AJU'!H66","v":0},null,{"$f":"'DEMANDE BUDGET AJU'!J66","v":0},{"$f":"'DEMANDE BUDGET AJU'!R66","v":0},{"$f":"'DEMANDE BUDGET AJU'!Q66","v":0},{"$f":"IF('DEMANDE BUDGET AJU'!P66=0,'DEMANDE BUDGET AJU'!M66,K59/J59)","v":0},0,0]
[null,null,{"$f":"'DEMANDE BUDGET AJU'!C67","v":"Autre : (compléter soi-même)"},null,null,null,{"$f":"'DEMANDE BUDGET AJU'!H67","v":0},null,{"$f":"'DEMANDE BUDGET AJU'!J67","v":0},{"$f":"'DEMANDE BUDGET AJU'!R67","v":0},{"$f":"'DEMANDE BUDGET AJU'!Q67","v":0},{"$f":"IF('DEMANDE BUDGET AJU'!P67=0,'DEMANDE BUDGET AJU'!M67,K60/J60)","v":0},{"$f":"J60-K60","v":0},{"$f":"IF(J60=0,0,M60/J60)","v":0}]
[null,null,{"$f":"'DEMANDE BUDGET AJU'!C68","v":"Autre : (compléter soi-même)"},null,null,null,{"$f":"'DEMANDE BUDGET AJU'!H68","v":0},null,{"$f":"'DEMANDE BUDGET AJU'!J68","v":0},{"$f":"'DEMANDE BUDGET AJU'!R68","v":0},{"$f":"'DEMANDE BUDGET AJU'!Q68","v":0},{"$f":"IF('DEMANDE BUDGET AJU'!P68=0,'DEMANDE BUDGET AJU'!M68,K61/J61)","v":0},0,0]
[null,null,"Total ",null,null,null,{"$f":"SUM(G50:G61)","v":0},null,null,{"$f":"SUM(J50:J61)","v":0},{"$f":"SUM(K50:K61)","v":0},{"$f":"IF(J62=0,0,K62/J62)","v":0},{"$f":"SUM(M50:M61)","v":0},{"$f":"IF(J62=0,0,M62/J62)","v":0}]
[null,null,null,null,null,"MAX DE FRAIS INDIRECTS AUTORISES **** :",null,null,null,null,{"$f":"(K23+K29+K35+K48)/100*7","v":0}]
[null,null,"TOTAL",null,null,null,null,null,null,{"$f":"J62+J48+J35+J29+J23","v":0},{"$f":"K62+K48+K35+K29+K23","v":0},0,{"$f":"M62+M48+M35+M29+M23","v":0},0]
[null,null,"* Si une partie ou l'entièreté de la subvention est utilisée comme co-financement, la répartition doit être indiquée ici. Veuillez ajouter une colonne par projet. "]
[null,null,"** Frais de fonctionnement directs : Il s'agit de frais qui ne peuvent pas être entièrement attribués de manière comptable au projet ou à l'activité. Si pas possible, ces frais peuvent être catégorisés comme 'autres frais de fonctionnement'.   "]
[null,null,"*** Frais de fonctionnement indirects : Il s'agit de frais qui ne peuvent pas être entièrement attribués de manière comptable au projet ou à l'activité. Ces frais sont attribués via une clef de répartition."]
[null,null," La clef de répartition utilisée doit être déclarée dans le rapport relatif au contenu. "]
[null,null,"**** max de frais indirects autorisés avec les subsides de Fedasil : 7% de la somme du personnel, de la location, des investissements et des frais de fonctionnement directs"]
[]
[null,null,"Financement",null,null,null,"Assurance",null,null,"Montant total du projet","Budget aju Fedasil  Approuvé (projet ou activité)","% Fedasil","Autres sources de financement","% autres sources"]
[null,null,{"$f":"'DEMANDE BUDGET AJU'!C79","v":"Fedasil"},null,null,null,{"$f":"'DEMANDE BUDGET AJU'!H79","v":"Demandé"},null,null,{"$f":"K72","v":0},{"$f":"K64","v":0},{"$f":"IF($J$64=0,0,K72/$J$64)","v":0}]
[null,null,{"$f":"'DEMANDE BUDGET AJU'!C80","v":"Moyens propres"},null,null,null,{"$f":"'DEMANDE BUDGET AJU'!H80","v":"(à compléter)"},null,null,{"$f":"M73","v":0},null,null,{"$f":"'DEMANDE BUDGET AJU'!N80","v":0},{"$f":"IF($J$64=0,0,M73/$J$64)","v":0}]
[null,null,{"$f":"'DEMANDE BUDGET AJU'!C81","v":"Autre rentrées : (compléter soi-même)"},null,null,null,{"$f":"'DEMANDE BUDGET AJU'!H81","v":"(à compléter)"},null,null,0,null,null,{"$f":"'DEMANDE BUDGET AJU'!N81","v":0},0]
[null,null,{"$f":"'DEMANDE BUDGET AJU'!C82","v":"Autre rentrées : (compléter soi-même)"},null,null,null,{"$f":"'DEMANDE BUDGET AJU'!H82","v":"(à compléter)"},null,null,0,null,null,{"$f":"'DEMANDE BUDGET AJU'!N82","v":0},0]
[null,null,{"$f":"'DEMANDE BUDGET AJU'!C83","v":"Autre rentrées : (compléter soi-même)"},null,null,null,{"$f":"'DEMANDE BUDGET AJU'!H83","v":"(à compléter)"},null,null,{"$f":"M76","v":0},null,null,{"$f":"'DEMANDE BUDGET AJU'!N83","v":0},0]
[null,null,{"$f":"'DEMANDE BUDGET AJU'!C84","v":"Dons"},null,null,null,{"$f":"'DEMANDE BUDGET AJU'!H84","v":"(à compléter)"},null,null,0,null,null,{"$f":"'DEMANDE BUDGET AJU'!N84","v":0},0]
[null,null,"TOTAL",null,null,null,null,null,null,{"$f":"SUM(J72:J77)","v":0},{"$f":"SUM(K72:K77)","v":0},{"$f":"IF($J$64=0,0,K78/$J$64)","v":0},{"$f":"SUM(M73:M77)","v":0},{"$f":"IF($J$64=0,0,M78/$J$64)","v":0}]
[]
[null,null,null,null,null,"DIFFERENCE ENTRE LE BUDGET ET LE FINANCEMENT",null,null,null,{"$f":"J64-J78","v":0},null,null,{"$f":"M64-M78","v":0}]

{"sheet":"INSTRUCTION DEPENSES REELLES","index":9,"n_rows":47,"n_cols":1,"rows_kept":47,"cut":false,"hidden":true,"merged":[]}
["INSTRUCTION DEPENSES REELLES"]
[]
["RAPPORT FINANCIER INTERMEDIAIRE"]
["PROPOSITION TIMING"]
["Voir convention "]
[]
["FORMAT DOCUMENTS"]
["version électronique + version imprimée en un seul exemplaire"]
[]
["QUELS DOCUMENTS"]
[" 1)  une liste d'aperçu détaillée en format Excel de toutes les dépenses des dépenses intermédiaires, qui doivent contenir les informations suivantes : "]
["*Une liste détaillée de chaque dépense individuelle, en mentionnant le montant, la date, le numéro du doucement, le code du projet, "]
["le nom du fournisseur et une brève description des frais engendrés ;"]
["* Pour les dépenses supérieures à 500€ : une description mieux détaillée et la motivation de la dépense effectuée dans le cadre des objectifs du projet ; "]
["* En ce qui concerne les frais de personnel : une motivation et/ou une preuve des personnes pour lesquelles des frais de personnel ont été introduits "]
["ayant travaillé pour la période désignée du projet ;"]
["* Une liste des sous)traitants et si besoin, la demande d'offre ;"]
[" 2) titre de créance en lien avec le deuxième acompte (30%) si les dépenses intermédiaires sont supérieures à la moitié de l'acompte initial, "]
["signé par les personnes morales.(autorisé par mail)"]
[]
["RAPPORT FINANCIER FINAL"]
["INTRODUIRE TIMING"]
["Au plus tard le 31 janvier, 1 mois après la fin de l'année du projet"]
[]
["FORMAT DES DOCUMENTS"]
["version électronique + version imprimée en un seul exemplaire"]
[]
["QUELS DOCUMENTS"]
["  1)  une liste récapitulative détaillée en format Excel de toutes les dépenses (\"listing\") qui doit contenir les informations suivantes : "]
["*Un décompte financier final des coûts subsidiables réellement faits, établi selon la structure du budget estimé,  "]
["accompagnée d'une copie des pièces justificatives."]
["Avant qu'une copie ne soit faite, le bénéficiaire indique sur les pièces justificatives originales la répartition éventuelle "]
["entre les différentes sources de financement. Ces indications doivent clairement montrer si le remboursement de l'Agence est intégralement ou partiellement "]
["récupéré."]
["* une liste récapitulative détaillée en format Excel avec une brève description pour les dépenses inférieures à 500€ "]
["et une description et motivation plus détaillées pour les dépenses supérieures à 500€."]
["* Les réponses à un certain nombre de questions spécifiques sur les procédures, comme décrites dans le template listing standard."]
[" 2) titre de créance en lien avec le dernier acompte (max 20%). Si 80% du budget du projet n'ont pas été dépensés, veuillez établir une note de crédit."]
[" 3) Au plus tard 6 mois après la fin de l'année relative à la convention, le bénéficiaire introduit une copie de l'année comptable approuvée."]
[]
[]
["QUE SOUHAITEZ-VOUS FAIRE MAINTENANT ?"]
["← cliquez sur le bouton"]
["← cliquez sur le bouton"]
["← cliquez sur le bouton"]
["← cliquez sur le bouton"]
["←  cliquez sur le bouton"]

{"sheet":"QUESTIONS RAPPORT FINAL","index":10,"n_rows":51,"n_cols":1,"rows_kept":51,"cut":false,"hidden":true,"merged":[[4,0,4,3],[36,0,36,3],[40,0,40,3],[44,0,44,3],[48,0,48,3],[8,0,8,3],[18,0,18,3],[24,0,24,3]]}
[]
[]
[]
[]
["QUESTIONS FINANCIERES RELATIVES AU RAPPORT FINAL"]
[]
["Note : Si la réponse a déjà été mentionnée ou expliquée dans le rapport financier, veuillez y faire référence."]
[]
["1. ORGANISATION"]
[]
["- L’organisation travaille-t-elle avec un bureau d'expertise comptable ? "]
[]
["- L'organisation travaille-t-elle avec un réviseur ? "]
[]
["- Veuillez nous fournir la comptabilité analytique pour le projet Fedasil"]
[]
["- Veuillez nous fournir le dernier compte des résultats approuvé, détaillé par rubrique "]
[]
["2. BUDGET"]
[]
["- Y a-t-il des excédents dans les crédits demandés ? Si oui, veuillez nous donner la raison du sous-emploi du subside."]
[]
["- Veuillez mentionner les éventuelles remarques en rapport avec les dépenses réalisées vs. le budget."]
[]
["3. FRAIS DE PERSONNEL"]
[]
["- Des modifications ont-elles eu lieu dans les frais de personnel ou leur désignation versus le budget ? Si oui, lesquelles ?"]
[]
["- Veuillez nous fournir les descriptions de fonction récentes, pour les personnes employées dans le cadre du projet. "]
[]
["- Veuillez motiver et prouver les clés de répartition utilisées. "]
[]
["- Veuillez nous fournir une copie des timesheets pour les personnes qui ne sont pas désignées à 100% au projet. "]
[]
["- Veuillez nous fournir le calcul du pécule de vacances et de la prime de fin d'année ? "]
[]
["4. LOCATION"]
[]
["- Veuillez motiver et prouver les clés de répartition utilisées. "]
[]
["5. INVESTISSEMENTS"]
[]
["- Veuillez nous expliquer les règles d'évaluation générales appliquées et les règles d'amortissement. "]
[]
["6. FRAIS DE FONCTIONNEMENT DIRECTS"]
[]
["- Veuillez nous fournir pour chaque sous-traitance les 3 offres auprès des 3 différents fournisseurs. "]
[]
["7. FRAIS DE FONCTIONNEMENT INDIRECTS"]
[]
["- Veuillez motiver et prouver les clés de répartition utilisées. "]

{"sheet":"ARGUMENTATION","index":11,"n_rows":60,"n_cols":1,"rows_kept":60,"cut":false,"hidden":true,"merged":[[4,0,14,0],[16,0,26,0],[28,0,38,0],[40,0,50,0]]}
["ARGUMENTATION DIFFERENCE BUDGET vs ACTUAL"]
[]
["RAPPORT FINANCIER FINAL"]
["FRAIS DE PERSONNEL"]
[]
[]
[]
[]
[]
[]
[]
[]
[]
[]
[]
["LOCATION"]
[]
[]
[]
[]
[]
[]
[]
[]
[]
[]
[]
["FRAIS DE FONCTIONNEMENT DIRECTS"]
[]
[]
[]
[]
[]
[]
[]
[]
[]
[]
[]
["FRAIS DE FONCTIONNEMENT INDIRECTS"]
[]
[]
[]
[]
[]
[]
[]
[]
[]
[]
[]
[]
[]
["QUE SOUHAITEZ-VOUS FAIRE"]
[]
["← cliquez sur le bouton"]
["← cliquez sur le bouton"]
["← cliquez sur le bouton"]
["← cliquez sur le bouton"]
["← cliquez sur le bouton"]

{"sheet":"Frais de personnel","index":12,"n_rows":142,"n_cols":23,"rows_kept":142,"cut":false,"hidden":true,"merged":[[132,0,133,1],[132,2,133,2],[132,19,133,19],[132,20,133,20],[143,1,143,17],[138,1,138,17],[139,1,139,17],[140,1,140,17],[141,1,141,17],[142,1,142,17],[132,21,133,21],[132,16,133,16],[132,13,133,13],[132,9,133,12],[0,19,2,22],[132,22,133,22],[4,18,19,18]]}
["Frais de personnel",null,"Tous les chiffres doivent pouvoir facilement être retrouvés dans les preuves fournies. Si pas, veuillez donner plus d'explications dans les remarques",null,null,null,null,null,null,null,null,null,null,null,null,null,null,null,null,"INPUT FEDASIL"]
[]
["1. Détail des frais"]
[]
["N° Doc.","Nom (ou 'à recruter')","Période\ndu       au","Équivalents plein temps","Salaire brut\n(A)","Cotisations patronales\n(B)","Frais de déplacement Domicile - Trvail\n(C)","Autres frais : à préciser\n(D)","Autres charges : à préciser\n(E)","Coût total\n(A+B+C+D+E)=F","% du temps de travail affecté à Fedasil (G)","Montant financement Total","% taux financement fedasil","Montant taux financement fedasil","% taux de financement autre sources de financement","Remarques","Autres sources de financement dépenses réelles","% autres sources",null,"Subsidiable Fedasil","Non subsidiable","Remarques FEDASIL après contrôle","Info OPE FEDASIL"]
[null,{"$f":"'BUDGET AJU APPROUVE'!C15","v":"(nom à compléter)"},"janvier",null,null,null,null,null,null,{"$f":"+E6+F6+G6+H6+I6","v":0},null,{"$f":"+J6*K6","v":0},{"$f":"'BUDGET AJU APPROUVE'!$L$15","v":0},{"$f":"L6*M6","v":0},{"$f":"1-M6","v":1},null,{"$f":"L6-N6","v":0},{"$f":"IFERROR(Q6/J6,0)","v":0},null,{"$f":"N6-U6","v":0}]
[null,null,"février",null,null,null,null,null,null,{"$f":"+E7+F7+G7+H7+I7","v":0},null,{"$f":"+J7*K7","v":0},{"$f":"'BUDGET AJU APPROUVE'!$L$15","v":0},{"$f":"L7*M7","v":0},{"$f":"1-M7","v":1},null,{"$f":"L7-N7","v":0},{"$f":"IFERROR(Q7/J7,0)","v":0},null,{"$f":"N7-U7","v":0}]
[null,null,"mars",null,null,null,null,null,null,{"$f":"+E8+F8+G8+H8+I8","v":0},null,0,{"$f":"'BUDGET AJU APPROUVE'!$L$15","v":0},0,1,null,0,0,null,0]
[null,null,"avril",null,null,null,null,null,null,0,null,0,{"$f":"'BUDGET AJU APPROUVE'!$L$15","v":0},0,1,null,0,0,null,0]
[null,null,"mai",null,null,null,null,null,null,0,null,0,{"$f":"'BUDGET AJU APPROUVE'!$L$15","v":0},0,1,null,0,0,null,0]
[null,null,"juin",null,null,null,null,null,null,0,null,0,{"$f":"'BUDGET AJU APPROUVE'!$L$15","v":0},0,1,null,0,0,null,0]
[null,null,"Pécule de vacances",null,null,null,null,null,null,0,null,0,{"$f":"'BUDGET AJU APPROUVE'!$L$15","v":0},0,1,null,0,0,null,0]
[null,null,"juillet",null,null,null,null,null,null,0,null,0,{"$f":"'BUDGET AJU APPROUVE'!$L$15","v":0},0,1,null,0,0,null,0]
[null,null,"août",null,null,null,null,null,null,0,null,0,{"$f":"'BUDGET AJU APPROUVE'!$L$15","v":0},0,1,null,0,0,null,0]
[null,null,"septembre",null,null,null,null,null,null,0,null,0,{"$f":"'BUDGET AJU APPROUVE'!$L$15","v":0},0,1,null,0,0,null,0]
[null,null,"octobre",null,null,null,null,null,null,0,null,0,{"$f":"'BUDGET AJU APPROUVE'!$L$15","v":0},0,1,null,0,0,null,0]
[null,null,"novembre",null,null,null,null,null,null,0,null,0,{"$f":"'BUDGET AJU APPROUVE'!$L$15","v":0},0,1,null,0,0,null,0]
[null,null,"décembre",null,null,null,null,null,null,0,null,0,{"$f":"'BUDGET AJU APPROUVE'!$L$15","v":0},0,1,null,0,0,null,0]
[null,null,"Prime de fin d'année",null,null,null,null,null,null,0,null,0,{"$f":"'BUDGET AJU APPROUVE'!$L$15","v":0},0,1,null,0,0,null,0]
[null,null,"TOTAL",null,{"$f":"SUM(E6:E19)","v":0},0,0,0,0,{"$f":"SUM(J6:J19)","v":0},null,{"$f":"SUM(L6:L19)","v":0},null,{"$f":"SUM(N6:N19)","v":0},{"$f":"AVERAGE(O6:O19)","v":1},null,{"$f":"SUM(Q6:Q19)","v":0},{"$f":"IFERROR(+Q20/J20,0)","v":0},null,{"$f":"SUM(T6:T19)","v":0},{"$f":"SUM(U6:U19)","v":0}]
[]
[null,{"$f":"'BUDGET AJU APPROUVE'!C16","v":"(nom à compléter)"},"janvier",null,null,null,null,null,null,{"$f":"+E22+F22+G22+H22+I22","v":0},null,{"$f":"+J22*K22","v":0},{"$f":"'BUDGET AJU APPROUVE'!$L$16","v":0},{"$f":"L22*M22","v":0},{"$f":"1-M22","v":1},null,{"$f":"L22-N22","v":0},{"$f":"IFERROR(Q22/J22,0)","v":0},null,{"$f":"N22-U22","v":0}]
[null,null,"février",null,null,null,null,null,null,0,null,{"$f":"+J23*K23","v":0},{"$f":"'BUDGET AJU APPROUVE'!$L$16","v":0},{"$f":"L23*M23","v":0},{"$f":"1-M23","v":1},null,{"$f":"L23-N23","v":0},{"$f":"IFERROR(Q23/J23,0)","v":0},null,0]
[null,null,"mars",null,null,null,null,null,null,{"$f":"+E24+F24+G24+H24+I24","v":0},null,0,{"$f":"'BUDGET AJU APPROUVE'!$L$16","v":0},0,1,null,0,0,null,0]
[null,null,"avril",null,null,null,null,null,null,{"$f":"+E25+F25+G25+H25+I25","v":0},null,0,{"$f":"'BUDGET AJU APPROUVE'!$L$16","v":0},0,1,null,0,0,null,0]
[null,null,"mai",null,null,null,null,null,null,0,null,0,{"$f":"'BUDGET AJU APPROUVE'!$L$16","v":0},0,1,null,0,0,null,0]
[null,null,"juin",null,null,null,null,null,null,0,null,0,{"$f":"'BUDGET AJU APPROUVE'!$L$16","v":0},0,1,null,0,0,null,0]
[null,null,"Pécule de vacances",null,null,null,null,null,null,0,null,0,{"$f":"'BUDGET AJU APPROUVE'!$L$16","v":0},0,1,null,0,0,null,0]
[null,null,"juillet",null,null,null,null,null,null,0,null,0,{"$f":"'BUDGET AJU APPROUVE'!$L$16","v":0},0,1,null,0,0,null,0]
[null,null,"août",null,null,null,null,null,null,0,null,0,{"$f":"'BUDGET AJU APPROUVE'!$L$16","v":0},0,1,null,0,0,null,0]
[null,null,"septembre",null,null,null,null,null,null,0,null,0,{"$f":"'BUDGET AJU APPROUVE'!$L$16","v":0},0,1,null,0,0,null,0]
[null,null,"octobre",null,null,null,null,null,null,0,null,0,{"$f":"'BUDGET AJU APPROUVE'!$L$16","v":0},0,1,null,0,0,null,0]
[null,null,"novembre",null,null,null,null,null,null,0,null,0,{"$f":"'BUDGET AJU APPROUVE'!$L$16","v":0},0,1,null,0,0,null,0]
[null,null,"décembre",null,null,null,null,null,null,0,null,0,{"$f":"'BUDGET AJU APPROUVE'!$L$16","v":0},0,1,null,0,0,null,0]
[null,null,"Prime de fin d'année",null,null,null,null,null,null,0,null,0,{"$f":"'BUDGET AJU APPROUVE'!$L$16","v":0},0,1,null,0,0,null,0]
[null,null,"TOTAL",null,{"$f":"SUM(E22:E35)","v":0},0,0,0,0,{"$f":"SUM(J22:J35)","v":0},null,{"$f":"SUM(L22:L35)","v":0},null,{"$f":"SUM(N22:N35)","v":0},{"$f":"AVERAGE(O22:O35)","v":1},null,{"$f":"SUM(Q22:Q35)","v":0},{"$f":"IFERROR(+Q36/J36,0)","v":0},null,{"$f":"SUM(T22:T35)","v":0},{"$f":"SUM(U23:U35)","v":0}]
[]
[null,{"$f":"'BUDGET AJU APPROUVE'!C17","v":"(nom à compléter)"},"janvier",null,null,null,null,null,null,{"$f":"+E38+F38+G38+H38+I38","v":0},null,{"$f":"+J38*K38","v":0},{"$f":"'BUDGET AJU APPROUVE'!$L$17","v":0},{"$f":"L38*M38","v":0},{"$f":"1-M38","v":1},null,{"$f":"L38-N38","v":0},{"$f":"IFERROR(Q38/J38,0)","v":0},null,{"$f":"N38-U38","v":0}]
[null,null,"février",null,null,null,null,null,null,0,null,{"$f":"+J39*K39","v":0},{"$f":"'BUDGET AJU APPROUVE'!$L$17","v":0},{"$f":"L39*M39","v":0},{"$f":"1-M39","v":1},null,{"$f":"L39-N39","v":0},{"$f":"IFERROR(Q39/J39,0)","v":0},null,0]
[null,null,"mars",null,null,null,null,null,null,{"$f":"+E40+F40+G40+H40+I40","v":0},null,0,{"$f":"'BUDGET AJU APPROUVE'!$L$17","v":0},0,1,null,0,0,null,0]
[null,null,"avril",null,null,null,null,null,null,{"$f":"+E41+F41+G41+H41+I41","v":0},null,0,{"$f":"'BUDGET AJU APPROUVE'!$L$17","v":0},0,1,null,0,0,null,0]
[null,null,"mai",null,null,null,null,null,null,0,null,0,{"$f":"'BUDGET AJU APPROUVE'!$L$17","v":0},0,1,null,0,0,null,0]
[null,null,"juin",null,null,null,null,null,null,0,null,0,{"$f":"'BUDGET AJU APPROUVE'!$L$17","v":0},0,1,null,0,0,null,0]
[null,null,"Pécule de vacances",null,null,null,null,null,null,0,null,0,{"$f":"'BUDGET AJU APPROUVE'!$L$17","v":0},0,1,null,0,0,null,0]
[null,null,"juillet",null,null,null,null,null,null,0,null,0,{"$f":"'BUDGET AJU APPROUVE'!$L$17","v":0},0,1,null,0,0,null,0]
[null,null,"août",null,null,null,null,null,null,0,null,0,{"$f":"'BUDGET AJU APPROUVE'!$L$17","v":0},0,1,null,0,0,null,0]
[null,null,"septembre",null,null,null,null,null,null,0,null,0,{"$f":"'BUDGET AJU APPROUVE'!$L$17","v":0},0,1,null,0,0,null,0]
[null,null,"octobre",null,null,null,null,null,null,0,null,0,{"$f":"'BUDGET AJU APPROUVE'!$L$17","v":0},0,1,null,0,0,null,0]
[null,null,"novembre",null,null,null,null,null,null,0,null,0,{"$f":"'BUDGET AJU APPROUVE'!$L$17","v":0},0,1,null,0,0,null,0]
[null,null,"décembre",null,null,null,null,null,null,0,null,0,{"$f":"'BUDGET AJU APPROUVE'!$L$17","v":0},0,1,null,0,0,null,0]
[null,null,"Prime de fin d'année",null,null,null,null,null,null,0,null,0,{"$f":"'BUDGET AJU APPROUVE'!$L$17","v":0},0,1,null,0,0,null,0]
[null,null,"TOTAL",null,{"$f":"SUM(E38:E51)","v":0},0,0,0,0,{"$f":"SUM(J38:J51)","v":0},null,{"$f":"SUM(L38:L51)","v":0},null,{"$f":"SUM(N38:N51)","v":0},{"$f":"AVERAGE(O38:O51)","v":1},null,{"$f":"SUM(Q38:Q51)","v":0},{"$f":"IFERROR(+Q52/J52,0)","v":0},null,{"$f":"SUM(T38:T51)","v":0},{"$f":"SUM(U39:U51)","v":0}]
[]
[null,{"$f":"'BUDGET AJU APPROUVE'!C18","v":"(nom à compléter)"},"janvier",null,null,null,null,null,null,{"$f":"+E54+F54+G54+H54+I54","v":0},null,{"$f":"+J54*K54","v":0},{"$f":"'BUDGET AJU APPROUVE'!$L$18","v":0},{"$f":"L54*M54","v":0},{"$f":"1-M54","v":1},null,{"$f":"L54-N54","v":0},{"$f":"IFERROR(Q54/J54,0)","v":0},null,{"$f":"N54-U54","v":0}]
[null,null,"février",null,null,null,null,null,null,0,null,0,{"$f":"'BUDGET AJU APPROUVE'!$L$18","v":0},{"$f":"L55*M55","v":0},{"$f":"1-M55","v":1},null,{"$f":"L55-N55","v":0},{"$f":"IFERROR(Q55/J55,0)","v":0},null,0]
[null,null,"mars",null,null,null,null,null,null,0,null,0,{"$f":"'BUDGET AJU APPROUVE'!$L$18","v":0},0,1,null,0,0,null,0]
[null,null,"avril",null,null,null,null,null,null,0,null,0,{"$f":"'BUDGET AJU APPROUVE'!$L$18","v":0},0,1,null,0,0,null,0]
[null,null,"mai",null,null,null,null,null,null,0,null,0,{"$f":"'BUDGET AJU APPROUVE'!$L$18","v":0},0,1,null,0,0,null,0]
[null,null,"juin",null,null,null,null,null,null,0,null,0,{"$f":"'BUDGET AJU APPROUVE'!$L$18","v":0},0,1,null,0,0,null,0]
[null,null,"Pécule de vacances",null,null,null,null,null,null,0,null,0,{"$f":"'BUDGET AJU APPROUVE'!$L$18","v":0},0,1,null,0,0,null,0]
[null,null,"juillet",null,null,null,null,null,null,0,null,0,{"$f":"'BUDGET AJU APPROUVE'!$L$18","v":0},0,1,null,0,0,null,0]
[null,null,"août",null,null,null,null,null,null,0,null,0,{"$f":"'BUDGET AJU APPROUVE'!$L$18","v":0},0,1,null,0,0,null,0]
[null,null,"septembre",null,null,null,null,null,null,0,null,0,{"$f":"'BUDGET AJU APPROUVE'!$L$18","v":0},0,1,null,0,0,null,0]
[null,null,"octobre",null,null,null,null,null,null,0,null,0,{"$f":"'BUDGET AJU APPROUVE'!$L$18","v":0},0,1,null,0,0,null,0]
[null,null,"novembre",null,null,null,null,null,null,0,null,0,{"$f":"'BUDGET AJU APPROUVE'!$L$18","v":0},0,1,null,0,0,null,0]
[null,null,"décembre",null,null,null,null,null,null,0,null,0,{"$f":"'BUDGET AJU APPROUVE'!$L$18","v":0},0,1,null,0,0,null,0]
[null,null,"Prime de fin d'année",null,null,null,null,null,null,0,null,0,{"$f":"'BUDGET AJU APPROUVE'!$L$18","v":0},0,1,null,0,0,null,0]
[null,null,"TOTAL",null,{"$f":"SUM(E54:E67)","v":0},0,0,0,0,{"$f":"SUM(J54:J67)","v":0},null,{"$f":"SUM(L54:L67)","v":0},null,{"$f":"SUM(N54:N67)","v":0},{"$f":"AVERAGE(O54:O67)","v":1},null,{"$f":"SUM(Q54:Q67)","v":0},{"$f":"IFERROR(+Q68/J68,0)","v":0},null,{"$f":"SUM(T54:T67)","v":0},{"$f":"SUM(U55:U67)","v":0}]
[]
[null,{"$f":"'BUDGET AJU APPROUVE'!C19","v":"(nom à compléter)"},"janvier",null,null,null,null,null,null,{"$f":"+E70+F70+G70+H70+I70","v":0},null,0,{"$f":"'BUDGET AJU APPROUVE'!$L$19","v":0},{"$f":"L70*M70","v":0},{"$f":"1-M70","v":1},null,{"$f":"L70-N70","v":0},{"$f":"IFERROR(Q70/J70,0)","v":0},null,{"$f":"N70-U70","v":0}]
[null,null,"février",null,null,null,null,null,null,0,null,0,{"$f":"'BUDGET AJU APPROUVE'!$L$19","v":0},{"$f":"L71*M71","v":0},{"$f":"1-M71","v":1},null,{"$f":"L71-N71","v":0},{"$f":"IFERROR(Q71/J71,0)","v":0},null,0]
[null,null,"mars",null,null,null,null,null,null,0,null,0,{"$f":"'BUDGET AJU APPROUVE'!$L$19","v":0},0,1,null,0,0,null,0]
[null,null,"avril",null,null,null,null,null,null,0,null,0,{"$f":"'BUDGET AJU APPROUVE'!$L$19","v":0},0,1,null,0,0,null,0]
[null,null,"mai",null,null,null,null,null,null,0,null,0,{"$f":"'BUDGET AJU APPROUVE'!$L$19","v":0},0,1,null,0,0,null,0]
[null,null,"juin",null,null,null,null,null,null,0,null,0,{"$f":"'BUDGET AJU APPROUVE'!$L$19","v":0},0,1,null,0,0,null,0]
[null,null,"Pécule de vacances",null,null,null,null,null,null,0,null,0,{"$f":"'BUDGET AJU APPROUVE'!$L$19","v":0},0,1,null,0,0,null,0]
[null,null,"juillet",null,null,null,null,null,null,0,null,0,{"$f":"'BUDGET AJU APPROUVE'!$L$19","v":0},0,1,null,0,0,null,0]
[null,null,"août",null,null,null,null,null,null,0,null,0,{"$f":"'BUDGET AJU APPROUVE'!$L$19","v":0},0,1,null,0,0,null,0]
[null,null,"septembre",null,null,null,null,null,null,0,null,0,{"$f":"'BUDGET AJU APPROUVE'!$L$19","v":0},0,1,null,0,0,null,0]
[null,null,"octobre",null,null,null,null,null,null,0,null,0,{"$f":"'BUDGET AJU APPROUVE'!$L$19","v":0},0,1,null,0,0,null,0]
[null,null,"novembre",null,null,null,null,null,null,0,null,0,{"$f":"'BUDGET AJU APPROUVE'!$L$19","v":0},0,1,null,0,0,null,0]
[null,null,"décembre",null,null,null,null,null,null,0,null,0,{"$f":"'BUDGET AJU APPROUVE'!$L$19","v":0},0,1,null,0,0,null,0]
[null,null,"Prime de fin d'année",null,null,null,null,null,null,0,null,0,{"$f":"'BUDGET AJU APPROUVE'!$L$19","v":0},0,1,null,0,0,null,0]
[null,null,"TOTAL",null,{"$f":"SUM(E70:E83)","v":0},0,0,0,0,{"$f":"SUM(J70:J83)","v":0},null,{"$f":"SUM(L70:L83)","v":0},null,{"$f":"SUM(N70:N83)","v":0},{"$f":"AVERAGE(O70:O83)","v":1},null,{"$f":"SUM(Q70:Q83)","v":0},{"$f":"IFERROR(+Q84/J84,0)","v":0},null,{"$f":"SUM(T70:T83)","v":0},{"$f":"SUM(U71:U83)","v":0}]
[]
[null,{"$f":"'BUDGET AJU APPROUVE'!C20","v":"(nom à compléter)"},"janvier",null,null,null,null,null,null,{"$f":"+E86+F86+G86+H86+I86","v":0},null,0,{"$f":"'BUDGET AJU APPROUVE'!$L$20","v":0},{"$f":"L86*M86","v":0},{"$f":"1-M86","v":1},null,{"$f":"L86-N86","v":0},{"$f":"IFERROR(Q86/J86,0)","v":0},null,{"$f":"N86-U86","v":0}]
[null,null,"février",null,null,null,null,null,null,0,null,0,{"$f":"'BUDGET AJU APPROUVE'!$L$20","v":0},{"$f":"L87*M87","v":0},{"$f":"1-M87","v":1},null,{"$f":"L87-N87","v":0},{"$f":"IFERROR(Q87/J87,0)","v":0},null,0]
[null,null,"mars",null,null,null,null,null,null,0,null,0,{"$f":"'BUDGET AJU APPROUVE'!$L$20","v":0},0,1,null,0,0,null,0]
[null,null,"avril",null,null,null,null,null,null,0,null,0,{"$f":"'BUDGET AJU APPROUVE'!$L$20","v":0},0,1,null,0,0,null,0]
[null,null,"mai",null,null,null,null,null,null,0,null,0,{"$f":"'BUDGET AJU APPROUVE'!$L$20","v":0},0,1,null,0,0,null,0]
[null,null,"juin",null,null,null,null,null,null,0,null,0,{"$f":"'BUDGET AJU APPROUVE'!$L$20","v":0},0,1,null,0,0,null,0]
[null,null,"Pécule de vacances",null,null,null,null,null,null,0,null,0,{"$f":"'BUDGET AJU APPROUVE'!$L$20","v":0},0,1,null,0,0,null,0]
[null,null,"juillet",null,null,null,null,null,null,0,null,0,{"$f":"'BUDGET AJU APPROUVE'!$L$20","v":0},0,1,null,0,0,null,0]
[null,null,"août",null,null,null,null,null,null,0,null,0,{"$f":"'BUDGET AJU APPROUVE'!$L$20","v":0},0,1,null,0,0,null,0]
[null,null,"septembre",null,null,null,null,null,null,0,null,0,{"$f":"'BUDGET AJU APPROUVE'!$L$20","v":0},0,1,null,0,0,null,0]
[null,null,"octobre",null,null,null,null,null,null,0,null,0,{"$f":"'BUDGET AJU APPROUVE'!$L$20","v":0},0,1,null,0,0,null,0]
[null,null,"novembre",null,null,null,null,null,null,0,null,0,{"$f":"'BUDGET AJU APPROUVE'!$L$20","v":0},0,1,null,0,0,null,0]
[null,null,"décembre",null,null,null,null,null,null,0,null,0,{"$f":"'BUDGET AJU APPROUVE'!$L$20","v":0},0,1,null,0,0,null,0]
[null,null,"Prime de fin d'année",null,null,null,null,null,null,0,null,0,{"$f":"'BUDGET AJU APPROUVE'!$L$20","v":0},0,1,null,0,0,null,0]
[null,null,"TOTAL",null,{"$f":"SUM(E86:E99)","v":0},0,0,0,0,{"$f":"SUM(J86:J99)","v":0},null,{"$f":"SUM(L86:L99)","v":0},null,{"$f":"SUM(N86:N99)","v":0},{"$f":"AVERAGE(O86:O99)","v":1},null,{"$f":"SUM(Q86:Q99)","v":0},{"$f":"IFERROR(+Q100/J100,0)","v":0},null,{"$f":"SUM(T86:T99)","v":0},{"$f":"SUM(U87:U99)","v":0}]
[]
[null,{"$f":"'BUDGET AJU APPROUVE'!C21","v":"(nom à compléter)"},"janvier",null,null,null,null,null,null,{"$f":"+E102+F102+G102+H102+I102","v":0},null,0,{"$f":"'BUDGET AJU APPROUVE'!$L$21","v":0},{"$f":"L102*M102","v":0},{"$f":"1-M102","v":1},null,{"$f":"L102-N102","v":0},{"$f":"IFERROR(Q102/J102,0)","v":0},null,{"$f":"N102-U102","v":0}]
[null,null,"février",null,null,null,null,null,null,0,null,0,{"$f":"'BUDGET AJU APPROUVE'!$L$21","v":0},{"$f":"L103*M103","v":0},{"$f":"1-M103","v":1},null,{"$f":"L103-N103","v":0},{"$f":"IFERROR(Q103/J103,0)","v":0},null,0]
[null,null,"mars",null,null,null,null,null,null,0,null,0,{"$f":"'BUDGET AJU APPROUVE'!$L$21","v":0},0,1,null,0,0,null,0]
[null,null,"avril",null,null,null,null,null,null,0,null,0,{"$f":"'BUDGET AJU APPROUVE'!$L$21","v":0},0,1,null,0,0,null,0]
[null,null,"mai",null,null,null,null,null,null,0,null,0,{"$f":"'BUDGET AJU APPROUVE'!$L$21","v":0},0,1,null,0,0,null,0]
[null,null,"juin",null,null,null,null,null,null,0,null,0,{"$f":"'BUDGET AJU APPROUVE'!$L$21","v":0},0,1,null,0,0,null,0]
[null,null,"Pécule de vacances",null,null,null,null,null,null,0,null,0,{"$f":"'BUDGET AJU APPROUVE'!$L$21","v":0},0,1,null,0,0,null,0]
[null,null,"juillet",null,null,null,null,null,null,0,null,0,{"$f":"'BUDGET AJU APPROUVE'!$L$21","v":0},0,1,null,0,0,null,0]
[null,null,"août",null,null,null,null,null,null,0,null,0,{"$f":"'BUDGET AJU APPROUVE'!$L$21","v":0},0,1,null,0,0,null,0]
[null,null,"septembre",null,null,null,null,null,null,0,null,0,{"$f":"'BUDGET AJU APPROUVE'!$L$21","v":0},0,1,null,0,0,null,0]
[null,null,"octobre",null,null,null,null,null,null,0,null,0,{"$f":"'BUDGET AJU APPROUVE'!$L$21","v":0},0,1,null,0,0,null,0]
[null,null,"novembre",null,null,null,null,null,null,0,null,0,{"$f":"'BUDGET AJU APPROUVE'!$L$21","v":0},0,1,null,0,0,null,0]
[null,null,"décembre",null,null,null,null,null,null,0,null,0,{"$f":"'BUDGET AJU APPROUVE'!$L$21","v":0},0,1,null,0,0,null,0]
[null,null,"Prime de fin d'année",null,null,null,null,null,null,0,null,0,{"$f":"'BUDGET AJU APPROUVE'!$L$21","v":0},0,1,null,0,0,null,0]
[null,null,"TOTAL",null,{"$f":"SUM(E102:E115)","v":0},0,0,0,0,{"$f":"SUM(J102:J115)","v":0},null,{"$f":"SUM(L102:L115)","v":0},null,{"$f":"SUM(N102:N115)","v":0},{"$f":"AVERAGE(O102:O115)","v":1},null,{"$f":"SUM(Q102:Q115)","v":0},{"$f":"IFERROR(+Q116/J116,0)","v":0},null,{"$f":"SUM(T102:T115)","v":0},{"$f":"SUM(U103:U115)","v":0}]
[]
[null,{"$f":"'BUDGET AJU APPROUVE'!C22","v":"(nom à compléter)"},"janvier",null,null,null,null,null,null,{"$f":"+E118+F118+G118+H118+I118","v":0},null,0,{"$f":"'BUDGET AJU APPROUVE'!$L$22","v":0},{"$f":"L118*M118","v":0},{"$f":"1-M118","v":1},null,{"$f":"L118-N118","v":0},{"$f":"IFERROR(Q118/J118,0)","v":0},null,{"$f":"N118-U118","v":0}]
[null,null,"février",null,null,null,null,null,null,0,null,0,{"$f":"'BUDGET AJU APPROUVE'!$L$22","v":0},{"$f":"L119*M119","v":0},{"$f":"1-M119","v":1},null,{"$f":"L119-N119","v":0},{"$f":"IFERROR(Q119/J119,0)","v":0},null,0]
[null,null,"mars",null,null,null,null,null,null,0,null,0,{"$f":"'BUDGET AJU APPROUVE'!$L$22","v":0},0,1,null,0,0,null,0]
[null,null,"avril",null,null,null,null,null,null,0,null,0,{"$f":"'BUDGET AJU APPROUVE'!$L$22","v":0},0,1,null,0,0,null,0]
[null,null,"mai",null,null,null,null,null,null,0,null,0,{"$f":"'BUDGET AJU APPROUVE'!$L$22","v":0},0,1,null,0,0,null,0]
[null,null,"juin",null,null,null,null,null,null,0,null,0,{"$f":"'BUDGET AJU APPROUVE'!$L$22","v":0},0,1,null,0,0,null,0]
[null,null,"Pécule de vacances",null,null,null,null,null,null,0,null,0,{"$f":"'BUDGET AJU APPROUVE'!$L$22","v":0},0,1,null,0,0,null,0]
[null,null,"juillet",null,null,null,null,null,null,0,null,0,{"$f":"'BUDGET AJU APPROUVE'!$L$22","v":0},0,1,null,0,0,null,0]
[null,null,"août",null,null,null,null,null,null,0,null,0,{"$f":"'BUDGET AJU APPROUVE'!$L$22","v":0},0,1,null,0,0,null,0]
[null,null,"septembre",null,null,null,null,null,null,0,null,0,{"$f":"'BUDGET AJU APPROUVE'!$L$22","v":0},0,1,null,0,0,null,0]
[null,null,"octobre",null,null,null,null,null,null,0,null,0,{"$f":"'BUDGET AJU APPROUVE'!$L$22","v":0},0,1,null,0,0,null,0]
[null,null,"novembre",null,null,null,null,null,null,0,null,0,{"$f":"'BUDGET AJU APPROUVE'!$L$22","v":0},0,1,null,0,0,null,0]
[null,null,"décembre",null,null,null,null,null,null,0,null,0,{"$f":"'BUDGET AJU APPROUVE'!$L$22","v":0},0,1,null,0,0,null,0]
[null,null,"Prime de fin d'année",null,null,null,null,null,null,0,null,{"$f":"+J131*K131","v":0},{"$f":"'BUDGET AJU APPROUVE'!$L$22","v":0},0,1,null,0,0,null,0]
[null,null,"TOTAL",null,{"$f":"SUM(E118:E131)","v":0},0,0,0,0,{"$f":"SUM(J118:J131)","v":0},null,{"$f":"SUM(L118:L131)","v":0},null,{"$f":"SUM(N118:N131)","v":0},{"$f":"AVERAGE(O118:O131)","v":1},null,{"$f":"SUM(Q118:Q131)","v":0},{"$f":"IFERROR(+Q132/J132,0)","v":0},null,{"$f":"SUM(T118:T131)","v":0},{"$f":"SUM(U119:U131)","v":0}]
["TOTAL BUDGET APPROUVE",null,{"$f":"'BUDGET AJU APPROUVE'!K23","v":0},null,null,null,null,null,null,"TOTAL FRAIS REELS",null,null,null,{"$f":"N132+N116+N100+N84+N68+N52+N36+N20","v":0},null,null,{"$f":"Q20+Q36+Q52+Q68+Q84+Q100+Q116+Q132","v":0},null,null,{"$f":"T20+T36+T52+T68+T84+T100+T116+T132","v":0},{"$f":"U20+U36+U52+U68+U84+U100+U116+U132","v":0}]
[]
[]
[]
["2. Checklist Frais de Personnel"]
[]
[null,"Est-ce que les fiches individuelles (ou un autre document généré par une instance tièrce qui certifie les dépenses) sont présentes par membre du personnel affecté au projet"]
[null,"Est-ce que toutes les dépenses sont clairement et facilement retrouvable dans les pièces justificatives jointes?"]
[null,"Est-ce que le nom du membre du personnel affecté au projet est correctement rempli dans la colonne B? "]
[null,"Est-ce que les différentes dépenses  sont reprises avec des additions dans les différentes colonnes?"]

{"sheet":"Location","index":13,"n_rows":65,"n_cols":16,"rows_kept":65,"cut":false,"hidden":true,"merged":[[67,1,67,10],[68,1,68,10],[57,0,58,2],[57,3,58,3],[61,0,62,10],[63,1,63,10],[64,1,64,10],[65,1,65,10],[57,4,58,6],[57,9,58,9],[57,7,58,7],[57,8,58,8],[66,1,66,10],[0,12,2,15],[57,15,58,15],[57,12,58,12],[57,13,58,13],[57,14,58,14]]}
["Location",null,null,"Tous les chiffres doivent pouvoir être facilement retrouvés dans les preuves fournies.Si pas, veuillez fournir davantage d'explications dans les remarques",null,null,null,null,null,null,null,null,"INPUT FEDASIL"]
[]
["1. Détail frais"]
[]
["N° doc.","Date facture","Code du projet","Loueur","Description","Valeur locative (100%)","% financement Fedasil  [C]","Frais total Fedasil\n(A)* [C]","Remarques","Autres sources de financement dépenses réelles","% autres sources",null,"Subsidiable Fedasil","Non subsidiable Fedasil","Remarques FEDASIL après contrôle","Info OPE FEDASIL"]
[null,null,null,null,null,null,{"$f":"'BUDGET AJU APPROUVE'!$L$25","v":0},{"$f":"+F6*G6","v":0},null,{"$f":"F6-H6","v":0},{"$f":"IFERROR(+J6/F6,0)","v":0},null,{"$f":"H6-N6","v":0}]
[null,null,null,null,null,null,{"$f":"'BUDGET AJU APPROUVE'!$L$25","v":0},{"$f":"+F7*G7","v":0},null,0,{"$f":"IFERROR(+J7/F7,0)","v":0},null,{"$f":"H7-N7","v":0}]
[null,null,null,null,null,null,{"$f":"'BUDGET AJU APPROUVE'!$L$25","v":0},0,null,0,0,null,0]
[null,null,null,null,null,null,{"$f":"'BUDGET AJU APPROUVE'!$L$25","v":0},0,null,0,0,null,0]
[null,null,null,null,null,null,{"$f":"'BUDGET AJU APPROUVE'!$L$25","v":0},0,null,0,0,null,0]
[null,null,null,null,null,null,{"$f":"'BUDGET AJU APPROUVE'!$L$25","v":0},0,null,0,0,null,0]
[null,null,null,null,null,null,{"$f":"'BUDGET AJU APPROUVE'!$L$25","v":0},0,null,0,0,null,0]
[null,null,null,null,null,null,{"$f":"'BUDGET AJU APPROUVE'!$L$25","v":0},0,null,0,0,null,0]
[null,null,null,null,null,null,{"$f":"'BUDGET AJU APPROUVE'!$L$25","v":0},0,null,0,0,null,0]
[null,null,null,null,null,null,{"$f":"'BUDGET AJU APPROUVE'!$L$25","v":0},0,null,0,0,null,0]
[null,null,null,null,null,null,{"$f":"'BUDGET AJU APPROUVE'!$L$25","v":0},0,null,0,0,null,0]
[null,null,null,null,null,null,{"$f":"'BUDGET AJU APPROUVE'!$L$25","v":0},0,null,0,0,null,0]
[null,null,null,null,null,null,"TOTAL",{"$f":"SUM(H6:H17)","v":0},null,{"$f":"SUM(J6:J17)","v":0}]
[null,null,null,null,null,null,{"$f":"'BUDGET AJU APPROUVE'!$L$26","v":0},{"$f":"+F19*G19","v":0},null,{"$f":"F19-H19","v":0},{"$f":"IFERROR(+J19/F19,0)","v":0},null,{"$f":"H19-N19","v":0}]
[null,null,null,null,null,null,{"$f":"'BUDGET AJU APPROUVE'!$L$26","v":0},{"$f":"+F20*G20","v":0},null,0,0,null,{"$f":"H20-N20","v":0}]
[null,null,null,null,null,null,{"$f":"'BUDGET AJU APPROUVE'!$L$26","v":0},0,null,0,0,null,0]
[null,null,null,null,null,null,{"$f":"'BUDGET AJU APPROUVE'!$L$26","v":0},0,null,0,0,null,0]
[null,null,null,null,null,null,{"$f":"'BUDGET AJU APPROUVE'!$L$26","v":0},0,null,0,0,null,0]
[null,null,null,null,null,null,{"$f":"'BUDGET AJU APPROUVE'!$L$26","v":0},0,null,0,0,null,0]
[null,null,null,null,null,null,{"$f":"'BUDGET AJU APPROUVE'!$L$26","v":0},0,null,0,0,null,0]
[null,null,null,null,null,null,{"$f":"'BUDGET AJU APPROUVE'!$L$26","v":0},0,null,0,0,null,0]
[null,null,null,null,null,null,{"$f":"'BUDGET AJU APPROUVE'!$L$26","v":0},0,null,0,0,null,0]
[null,null,null,null,null,null,{"$f":"'BUDGET AJU APPROUVE'!$L$26","v":0},0,null,0,0,null,0]
[null,null,null,null,null,null,{"$f":"'BUDGET AJU APPROUVE'!$L$26","v":0},0,null,0,0,null,0]
[null,null,null,null,null,null,{"$f":"'BUDGET AJU APPROUVE'!$L$26","v":0},0,null,0,0,null,0]
[null,null,null,null,null,null,"TOTAL",{"$f":"SUM(H19:H30)","v":0},null,{"$f":"SUM(J19:J30)","v":0}]
[null,null,null,null,null,null,{"$f":"'BUDGET AJU APPROUVE'!$L$27","v":0},{"$f":"+F32*G32","v":0},null,{"$f":"F32-H32","v":0},{"$f":"IFERROR(+J32/F32,0)","v":0},null,{"$f":"H32-N32","v":0}]
[null,null,null,null,null,null,{"$f":"'BUDGET AJU APPROUVE'!$L$27","v":0},{"$f":"+F33*G33","v":0},null,0,0,null,{"$f":"H33-N33","v":0}]
[null,null,null,null,null,null,{"$f":"'BUDGET AJU APPROUVE'!$L$27","v":0},0,null,0,0,null,0]
[null,null,null,null,null,null,{"$f":"'BUDGET AJU APPROUVE'!$L$27","v":0},0,null,0,0,null,0]
[null,null,null,null,null,null,{"$f":"'BUDGET AJU APPROUVE'!$L$27","v":0},0,null,0,0,null,0]
[null,null,null,null,null,null,{"$f":"'BUDGET AJU APPROUVE'!$L$27","v":0},0,null,0,0,null,0]
[null,null,null,null,null,null,{"$f":"'BUDGET AJU APPROUVE'!$L$27","v":0},0,null,0,0,null,0]
[null,null,null,null,null,null,{"$f":"'BUDGET AJU APPROUVE'!$L$27","v":0},0,null,0,0,null,0]
[null,null,null,null,null,null,{"$f":"'BUDGET AJU APPROUVE'!$L$27","v":0},0,null,0,0,null,0]
[null,null,null,null,null,null,{"$f":"'BUDGET AJU APPROUVE'!$L$27","v":0},0,null,0,0,null,0]
[null,null,null,null,null,null,{"$f":"'BUDGET AJU APPROUVE'!$L$27","v":0},0,null,0,0,null,0]
[null,null,null,null,null,null,{"$f":"'BUDGET AJU APPROUVE'!$L$27","v":0},0,null,0,0,null,0]
[null,null,null,null,null,null,"TOTAL",{"$f":"SUM(H32:H43)","v":0},null,{"$f":"SUM(J32:J43)","v":0}]
[null,null,null,null,null,null,{"$f":"'BUDGET AJU APPROUVE'!$L$28","v":0},{"$f":"+F45*G45","v":0},null,{"$f":"F45-H45","v":0},{"$f":"IFERROR(+J45/F45,0)","v":0},null,{"$f":"H45-N45","v":0}]
[null,null,null,null,null,null,{"$f":"'BUDGET AJU APPROUVE'!$L$28","v":0},{"$f":"+F46*G46","v":0},null,0,0,null,{"$f":"H46-N46","v":0}]
[null,null,null,null,null,null,{"$f":"'BUDGET AJU APPROUVE'!$L$28","v":0},0,null,0,0,null,0]
[null,null,null,null,null,null,{"$f":"'BUDGET AJU APPROUVE'!$L$28","v":0},0,null,0,0,null,0]
[null,null,null,null,null,null,{"$f":"'BUDGET AJU APPROUVE'!$L$28","v":0},0,null,0,0,null,0]
[null,null,null,null,null,null,{"$f":"'BUDGET AJU APPROUVE'!$L$28","v":0},0,null,0,0,null,0]
[null,null,null,null,null,null,{"$f":"'BUDGET AJU APPROUVE'!$L$28","v":0},0,null,0,0,null,0]
[null,null,null,null,null,null,{"$f":"'BUDGET AJU APPROUVE'!$L$28","v":0},0,null,0,0,null,0]
[null,null,null,null,null,null,{"$f":"'BUDGET AJU APPROUVE'!$L$28","v":0},0,null,0,0,null,0]
[null,null,null,null,null,null,{"$f":"'BUDGET AJU APPROUVE'!$L$28","v":0},0,null,0,0,null,0]
[null,null,null,null,null,null,{"$f":"'BUDGET AJU APPROUVE'!$L$28","v":0},0,null,0,0,null,0]
[null,null,null,null,null,null,{"$f":"'BUDGET AJU APPROUVE'!$L$28","v":0},0,null,0,0,null,0]
[null,null,null,null,null,null,"TOTAL",{"$f":"SUM(H45:H56)","v":0},null,{"$f":"SUM(J45:J56)","v":0}]
["TOTAL BUDGET APPROUVE",null,null,{"$f":"'BUDGET AJU APPROUVE'!K29","v":0},"TOTAL FRAIS REELS",null,null,{"$f":"SUM(H18,H57,H31,H44)","v":0},null,{"$f":"SUM(J18,J57)","v":0},null,null,{"$f":"M57+M44+M31+M18","v":0},{"$f":"SUM(N57+N44+N31+N18)","v":0}]
[]
[]
[]
["2. Checklist Frais de Location"]
[]
[null,"Est-ce que les pièces justificatives concernant la location sont présentes par les frais de location affecté au projet"]
[null,"Est-ce que la clé d'affectation est bien expliquée?"]

{"sheet":"Investissements","index":14,"n_rows":19,"n_cols":18,"rows_kept":19,"cut":false,"hidden":true,"merged":[[9,11,10,11],[0,14,2,17],[9,17,10,17],[19,1,19,12],[20,1,20,12],[9,14,10,14],[9,15,10,15],[9,16,10,16],[13,0,14,10],[15,1,15,12],[16,1,16,12],[17,1,17,12],[18,1,18,12],[9,0,10,2],[9,3,10,3],[9,7,10,9],[9,10,10,10]]}
["Investissements ",null,null,"Tous les chiffres doivent pouvoir être facilement retrouvés dans les preuves fournies.Si pas, veuillez fournir davantage d'explications dans les remarques",null,null,null,null,null,null,null,null,null,null,"INPUT FEDASIL"]
[]
["1. Détail des frais"]
[]
["N° doc.","Date facture","Code du projet","Nom du fournisseur","Investissement","\nIndiquer une description de la dépense et le lien avec le projet si > 500 euros.","Valeur d'achat ou valeur de la location (100%)","Nombre d'années d'amortissement","Montant non amorti","% financement Fedasil ","Montant financement Fedasil","Autres sources de financement dépenses réelles","% autres sources",null,"Subsidiable Fedasil","Non subsidiable","Remarques FEDASIL après contrôle","Info OPE FEDASIL"]
[null,null,null,null,{"$f":"'BUDGET AJU APPROUVE'!C31","v":"(Compléter la description) "},null,null,null,{"$f":"IFERROR(+G6/H6,0)","v":0},{"$f":"'BUDGET AJU APPROUVE'!L31","v":0},{"$f":"+I6*J6","v":0},{"$f":"I6-K6","v":0},{"$f":"IFERROR(L6/I6,0)","v":0},null,{"$f":"J6-P6","v":0}]
[null,null,null,null,{"$f":"'BUDGET AJU APPROUVE'!C32","v":"(à compléter) "},null,null,null,{"$f":"IFERROR(+G7/H7,0)","v":0},{"$f":"'BUDGET AJU APPROUVE'!L32","v":0},{"$f":"+I7*J7","v":0},{"$f":"I7-K7","v":0},{"$f":"IFERROR(L7/I7,0)","v":0},null,{"$f":"J7-P7","v":0}]
[null,null,null,null,{"$f":"'BUDGET AJU APPROUVE'!C33","v":"(à compléter) "},null,null,null,0,{"$f":"'BUDGET AJU APPROUVE'!L33","v":0},0,0,0,null,0]
[null,null,null,null,{"$f":"'BUDGET AJU APPROUVE'!C34","v":"(à compléter) "},null,null,null,0,{"$f":"'BUDGET AJU APPROUVE'!L34","v":0},0,0,0,null,0]
["TOTAL BUDGET ATTRIBUE",null,null,{"$f":"'BUDGET AJU APPROUVE'!K35","v":0},null,null,null,"TOTAL FRAIS REELS",null,null,{"$f":"SUM(K6:K9)","v":0},{"$f":"SUM(L6:L9)","v":0},null,null,{"$f":"O6+O7+O8+O9","v":0},{"$f":"P6+P7+P8+P9","v":0}]
[]
[]
[]
["2. Checklist Frais d'investissements"]
[]
[null,"Est-ce que les pièces justificatives concernant les frais d'investissements sont présentes par les frais de location affecté au projet"]
[null,"Est-ce que la clé d'affectation est bien expliquée?"]
[null,"Est-ce que la dépense est faite dans la période de subsidiabilité? "]
[null,"Est-ce que les règles d'amortissements ont été respectées? En fonction de la date d'achat?"]

{"sheet":"Frais de fonctionnement directs","index":15,"n_rows":157,"n_cols":16,"rows_kept":157,"cut":false,"hidden":true,"merged":[[157,1,157,10],[158,1,158,10],[159,1,159,10],[135,3,146,3],[152,0,153,10],[154,1,154,10],[155,1,155,10],[156,1,156,10],[148,0,149,2],[148,3,149,3],[70,3,81,3],[83,3,94,3],[96,3,107,3],[109,3,120,3],[122,3,133,3],[5,3,16,3],[18,3,29,3],[31,3,42,3],[44,3,55,3],[57,3,68,3],[148,12,149,12],[148,13,149,13],[148,14,149,14],[0,5,0,10],[148,6,149,7],[148,8,149,8],[148,9,149,9],[148,5,149,5],[0,12,2,15],[148,15,149,15]]}
["Frais de fonctionnement directs",null,null,null,null,"Tous les chiffres doivent pouvoir être facilement retrouvés dans les preuves fournies.Si pas, veuillez fournir davantage \nd'explications dans les remarques",null,null,null,null,null,null,"INPUT FEDASIL"]
[]
["1. Détail frais"]
[]
["N° doc.","Date facture","Code du projet","Sous-rubrique","Nom du fournisseur","Une brève description pour les dépenses < 500 euros et une description et motivation plus détaillée pour les dépenses > 500 euros.","Total du montant de la facture","% financement Fedasil","Montant financement Fedasil","Autres sources de financement dépenses réelles","% autres sources",null,"Subsidiable Fedasil","Non subsidiable","Remarques FEDASIL après contrôle","Info OPE FEDASIL"]
[null,null,null,{"$f":"CONCATENATE('BUDGET AJU APPROUVE'!C37,'BUDGET AJU APPROUVE'!E37)","v":"Choisissez dans la liste Frais de fonctionnement directs "},null,null,null,{"$f":"'BUDGET AJU APPROUVE'!$L$37","v":0},{"$f":"G6*H6","v":0},{"$f":"G6-I6","v":0},{"$f":"IFERROR(+J6/G6,0)","v":0},null,{"$f":"I6-N6","v":0}]
[null,null,null,null,null,null,null,{"$f":"'BUDGET AJU APPROUVE'!$L$37","v":0},{"$f":"G7*H7","v":0},{"$f":"G7-I7","v":0},{"$f":"IFERROR(+J7/G7,0)","v":0},null,{"$f":"I7-N7","v":0}]
[null,null,null,null,null,null,null,{"$f":"'BUDGET AJU APPROUVE'!$L$37","v":0},0,0,0,null,0]
[null,null,null,null,null,null,null,{"$f":"'BUDGET AJU APPROUVE'!$L$37","v":0},0,0,0,null,0]
[null,null,null,null,null,null,null,{"$f":"'BUDGET AJU APPROUVE'!$L$37","v":0},{"$f":"G10*H10","v":0},{"$f":"G10-I10","v":0},{"$f":"IFERROR(+J10/G10,0)","v":0}]
[null,null,null,null,null,null,null,{"$f":"'BUDGET AJU APPROUVE'!$L$37","v":0},0,0,0,null,0]
[null,null,null,null,null,null,null,{"$f":"'BUDGET AJU APPROUVE'!$L$37","v":0},0,0,0,null,0]
[null,null,null,null,null,null,null,{"$f":"'BUDGET AJU APPROUVE'!$L$37","v":0},0,0,0,null,0]
[null,null,null,null,null,null,null,{"$f":"'BUDGET AJU APPROUVE'!$L$37","v":0},0,0,0,null,0]
[null,null,null,null,null,null,null,{"$f":"'BUDGET AJU APPROUVE'!$L$37","v":0},0,0,0,null,0]
[null,null,null,null,null,null,null,{"$f":"'BUDGET AJU APPROUVE'!$L$37","v":0},0,0,0,null,0]
[null,null,null,null,null,null,null,{"$f":"'BUDGET AJU APPROUVE'!$L$37","v":0},0,0,0,null,0]
[null,null,null,null,null,null,"TOTAL",null,{"$f":"SUM(I6:I17)","v":0},{"$f":"SUM(J6:J17)","v":0},null,null,{"$f":"SUM(M6:M17)","v":0},{"$f":"SUM(N6:N17)","v":0}]
[null,null,null,{"$f":"CONCATENATE('BUDGET AJU APPROUVE'!C38,'BUDGET AJU APPROUVE'!E38)","v":"Choisissez dans la liste Frais de fonctionnement directs "},null,null,null,{"$f":"'BUDGET AJU APPROUVE'!$L$38","v":0},{"$f":"G19*H19","v":0},0,{"$f":"IFERROR(+J19/G19,0)","v":0},null,{"$f":"I19-N19","v":0}]
[null,null,null,null,null,null,null,{"$f":"'BUDGET AJU APPROUVE'!$L$38","v":0},{"$f":"G20*H20","v":0},0,0,null,{"$f":"I20-N20","v":0}]
[null,null,null,null,null,null,null,{"$f":"'BUDGET AJU APPROUVE'!$L$38","v":0},0,0,0,null,0]
[null,null,null,null,null,null,null,{"$f":"'BUDGET AJU APPROUVE'!$L$38","v":0},0,0,0,null,{"$f":"I22-N22","v":0}]
[null,null,null,null,null,null,null,{"$f":"'BUDGET AJU APPROUVE'!$L$38","v":0},0,0,0,null,0]
[null,null,null,null,null,null,null,{"$f":"'BUDGET AJU APPROUVE'!$L$38","v":0},{"$f":"G24*H24","v":0},{"$f":"G24-I24","v":0},{"$f":"IFERROR(+J24/G24,0)","v":0}]
[null,null,null,null,null,null,null,{"$f":"'BUDGET AJU APPROUVE'!$L$38","v":0},0,0,0,null,0]
[null,null,null,null,null,null,null,{"$f":"'BUDGET AJU APPROUVE'!$L$38","v":0},0,0,0,null,0]
[null,null,null,null,null,null,null,{"$f":"'BUDGET AJU APPROUVE'!$L$38","v":0},0,0,0,null,0]
[null,null,null,null,null,null,null,{"$f":"'BUDGET AJU APPROUVE'!$L$38","v":0},0,0,0,null,0]
[null,null,null,null,null,null,null,{"$f":"'BUDGET AJU APPROUVE'!$L$38","v":0},0,0,0,null,0]
[null,null,null,null,null,null,null,{"$f":"'BUDGET AJU APPROUVE'!$L$38","v":0},0,0,0,null,0]
[null,null,null,null,null,null,"TOTAL",null,{"$f":"SUM(I19:I30)","v":0},{"$f":"SUM(J19:J30)","v":0},null,null,{"$f":"SUM(M19:M30)","v":0},{"$f":"SUM(N19:N30)","v":0}]
[null,null,null,{"$f":"CONCATENATE('BUDGET AJU APPROUVE'!C39,'BUDGET AJU APPROUVE'!E39)","v":"Choisissez dans la liste Frais de fonctionnement directs "},null,null,null,{"$f":"'BUDGET AJU APPROUVE'!$L$39","v":0},{"$f":"G32*H32","v":0},0,{"$f":"IFERROR(+J32/G32,0)","v":0},null,{"$f":"I32-N32","v":0}]
[null,null,null,null,null,null,null,{"$f":"'BUDGET AJU APPROUVE'!$L$39","v":0},{"$f":"G33*H33","v":0},0,0,null,{"$f":"I33-N33","v":0}]
[null,null,null,null,null,null,null,{"$f":"'BUDGET AJU APPROUVE'!$L$39","v":0},0,0,0,null,0]
[null,null,null,null,null,null,null,{"$f":"'BUDGET AJU APPROUVE'!$L$39","v":0},{"$f":"G35*H35","v":0},{"$f":"G35-I35","v":0},{"$f":"IFERROR(+J35/G35,0)","v":0}]
[null,null,null,null,null,null,null,{"$f":"'BUDGET AJU APPROUVE'!$L$39","v":0},0,0,0,null,{"$f":"I36-N36","v":0}]
[null,null,null,null,null,null,null,{"$f":"'BUDGET AJU APPROUVE'!$L$39","v":0},0,0,0,null,0]
[null,null,null,null,null,null,null,{"$f":"'BUDGET AJU APPROUVE'!$L$39","v":0},0,0,0,null,0]
[null,null,null,null,null,null,null,{"$f":"'BUDGET AJU APPROUVE'!$L$39","v":0},0,0,0,null,0]
[null,null,null,null,null,null,null,{"$f":"'BUDGET AJU APPROUVE'!$L$39","v":0},0,0,0,null,0]
[null,null,null,null,null,null,null,{"$f":"'BUDGET AJU APPROUVE'!$L$39","v":0},0,0,0,null,0]
[null,null,null,null,null,null,null,{"$f":"'BUDGET AJU APPROUVE'!$L$39","v":0},0,0,0,null,0]
[null,null,null,null,null,null,null,{"$f":"'BUDGET AJU APPROUVE'!$L$39","v":0},0,0,0,null,0]
[null,null,null,null,null,null,"TOTAL",null,{"$f":"SUM(I32:I43)","v":0},{"$f":"SUM(J32:J43)","v":0},null,null,{"$f":"SUM(M32:M43)","v":0},{"$f":"SUM(N32:N43)","v":0}]
[null,null,null,{"$f":"CONCATENATE('BUDGET AJU APPROUVE'!C40,'BUDGET AJU APPROUVE'!E40)","v":"Choisissez dans la liste Frais de fonctionnement directs "},null,null,null,{"$f":"'BUDGET AJU APPROUVE'!$L$40","v":0},{"$f":"G45*H45","v":0},0,{"$f":"IFERROR(+J45/G45,0)","v":0},null,{"$f":"I45-N45","v":0}]
[null,null,null,null,null,null,null,{"$f":"'BUDGET AJU APPROUVE'!$L$40","v":0},{"$f":"G46*H46","v":0},0,0,null,{"$f":"I46-N46","v":0}]
[null,null,null,null,null,null,null,{"$f":"'BUDGET AJU APPROUVE'!$L$40","v":0},0,0,0,null,0]
[null,null,null,null,null,null,null,{"$f":"'BUDGET AJU APPROUVE'!$L$40","v":0},0,0,0,null,{"$f":"I48-N48","v":0}]
[null,null,null,null,null,null,null,{"$f":"'BUDGET AJU APPROUVE'!$L$40","v":0},{"$f":"G49*H49","v":0},{"$f":"G49-I49","v":0},{"$f":"IFERROR(+J49/G49,0)","v":0}]
[null,null,null,null,null,null,null,{"$f":"'BUDGET AJU APPROUVE'!$L$40","v":0},0,0,0,null,0]
[null,null,null,null,null,null,null,{"$f":"'BUDGET AJU APPROUVE'!$L$40","v":0},0,0,0,null,0]
[null,null,null,null,null,null,null,{"$f":"'BUDGET AJU APPROUVE'!$L$40","v":0},0,0,0,null,0]
[null,null,null,null,null,null,null,{"$f":"'BUDGET AJU APPROUVE'!$L$40","v":0},0,0,0,null,0]
[null,null,null,null,null,null,null,{"$f":"'BUDGET AJU APPROUVE'!$L$40","v":0},0,0,0,null,0]
[null,null,null,null,null,null,null,{"$f":"'BUDGET AJU APPROUVE'!$L$40","v":0},0,0,0,null,{"$f":"I55-N55","v":0}]
[null,null,null,null,null,null,null,{"$f":"'BUDGET AJU APPROUVE'!$L$40","v":0},0,0,0,null,0]
[null,null,null,null,null,null,"TOTAL",null,{"$f":"SUM(I45:I56)","v":0},{"$f":"SUM(J45:J56)","v":0},null,null,{"$f":"SUM(M45:M56)","v":0},{"$f":"SUM(N45:N56)","v":0}]
[null,null,null,{"$f":"CONCATENATE('BUDGET AJU APPROUVE'!C41,'BUDGET AJU APPROUVE'!E41)","v":"Choisissez dans la liste Frais de fonctionnement directs "},null,null,null,{"$f":"'BUDGET AJU APPROUVE'!$L$41","v":0},{"$f":"G58*H58","v":0},0,{"$f":"IFERROR(+J58/G58,0)","v":0},null,{"$f":"I58-N58","v":0}]
[null,null,null,null,null,null,null,{"$f":"'BUDGET AJU APPROUVE'!$L$41","v":0},{"$f":"G59*H59","v":0},0,0,null,{"$f":"I59-N59","v":0}]
[null,null,null,null,null,null,null,{"$f":"'BUDGET AJU APPROUVE'!$L$41","v":0},0,0,0,null,0]
[null,null,null,null,null,null,null,{"$f":"'BUDGET AJU APPROUVE'!$L$41","v":0},0,0,0,null,{"$f":"I61-N61","v":0}]
[null,null,null,null,null,null,null,{"$f":"'BUDGET AJU APPROUVE'!$L$41","v":0},{"$f":"G62*H62","v":0},{"$f":"G62-I62","v":0},{"$f":"IFERROR(+J62/G62,0)","v":0}]
[null,null,null,null,null,null,null,{"$f":"'BUDGET AJU APPROUVE'!$L$41","v":0},0,0,0,null,0]
[null,null,null,null,null,null,null,{"$f":"'BUDGET AJU APPROUVE'!$L$41","v":0},0,0,0,null,0]
[null,null,null,null,null,null,null,{"$f":"'BUDGET AJU APPROUVE'!$L$41","v":0},0,0,0,null,0]
[null,null,null,null,null,null,null,{"$f":"'BUDGET AJU APPROUVE'!$L$41","v":0},0,0,0,null,0]
[null,null,null,null,null,null,null,{"$f":"'BUDGET AJU APPROUVE'!$L$41","v":0},0,0,0,null,0]
[null,null,null,null,null,null,null,{"$f":"'BUDGET AJU APPROUVE'!$L$41","v":0},0,0,0,null,0]
[null,null,null,null,null,null,null,{"$f":"'BUDGET AJU APPROUVE'!$L$41","v":0},0,0,0,null,0]
[null,null,null,null,null,null,"TOTAL",null,{"$f":"SUM(I58:I69)","v":0},{"$f":"SUM(J58:J69)","v":0},null,null,{"$f":"SUM(M58:M69)","v":0},{"$f":"SUM(N58:N69)","v":0}]
[null,null,null,{"$f":"CONCATENATE('BUDGET AJU APPROUVE'!C42,'BUDGET AJU APPROUVE'!E42)","v":"Choisissez dans la liste Frais de fonctionnement directs "},null,null,null,{"$f":"'BUDGET AJU APPROUVE'!$L$42","v":0},{"$f":"G71*H71","v":0},0,{"$f":"IFERROR(+J71/G71,0)","v":0},null,{"$f":"I71-N71","v":0}]
[null,null,null,null,null,null,null,{"$f":"'BUDGET AJU APPROUVE'!$L$42","v":0},{"$f":"G72*H72","v":0},0,0,null,{"$f":"I72-N72","v":0}]
[null,null,null,null,null,null,null,{"$f":"'BUDGET AJU APPROUVE'!$L$42","v":0},0,0,0,null,0]
[null,null,null,null,null,null,null,{"$f":"'BUDGET AJU APPROUVE'!$L$42","v":0},0,0,0,null,{"$f":"I74-N74","v":0}]
[null,null,null,null,null,null,null,{"$f":"'BUDGET AJU APPROUVE'!$L$42","v":0},{"$f":"G75*H75","v":0},{"$f":"G75-I75","v":0},{"$f":"IFERROR(+J75/G75,0)","v":0}]
[null,null,null,null,null,null,null,{"$f":"'BUDGET AJU APPROUVE'!$L$42","v":0},0,0,0,null,0]
[null,null,null,null,null,null,null,{"$f":"'BUDGET AJU APPROUVE'!$L$42","v":0},0,{"$f":"G77-I77","v":0},0,null,0]
[null,null,null,null,null,null,null,{"$f":"'BUDGET AJU APPROUVE'!$L$42","v":0},0,0,0,null,0]
[null,null,null,null,null,null,null,{"$f":"'BUDGET AJU APPROUVE'!$L$42","v":0},0,0,0,null,0]
[null,null,null,null,null,null,null,{"$f":"'BUDGET AJU APPROUVE'!$L$42","v":0},0,0,0,null,0]
[null,null,null,null,null,null,null,{"$f":"'BUDGET AJU APPROUVE'!$L$42","v":0},0,0,0,null,0]
[null,null,null,null,null,null,null,{"$f":"'BUDGET AJU APPROUVE'!$L$42","v":0},0,0,0,null,0]
[null,null,null,null,null,null,"TOTAL",null,{"$f":"SUM(I71:I82)","v":0},{"$f":"SUM(J71:J82)","v":0},null,null,{"$f":"SUM(M71:M82)","v":0},{"$f":"SUM(N71:N82)","v":0}]
[null,null,null,{"$f":"CONCATENATE('BUDGET AJU APPROUVE'!C43,'BUDGET AJU APPROUVE'!E43)","v":"Choisissez dans la liste Frais de fonctionnement directs "},null,null,null,{"$f":"'BUDGET AJU APPROUVE'!$L$43","v":0},{"$f":"G84*H84","v":0},0,{"$f":"IFERROR(+J84/G84,0)","v":0},null,{"$f":"I84-N84","v":0}]
[null,null,null,null,null,null,null,{"$f":"'BUDGET AJU APPROUVE'!$L$43","v":0},{"$f":"G85*H85","v":0},0,0,null,{"$f":"I85-N85","v":0}]
[null,null,null,null,null,null,null,{"$f":"'BUDGET AJU APPROUVE'!$L$43","v":0},0,0,0,null,0]
[null,null,null,null,null,null,null,{"$f":"'BUDGET AJU APPROUVE'!$L$43","v":0},0,0,0,null,{"$f":"I87-N87","v":0}]
[null,null,null,null,null,null,null,{"$f":"'BUDGET AJU APPROUVE'!$L$43","v":0},{"$f":"G88*H88","v":0},{"$f":"G88-I88","v":0},{"$f":"IFERROR(+J88/G88,0)","v":0}]
[null,null,null,null,null,null,null,{"$f":"'BUDGET AJU APPROUVE'!$L$43","v":0},0,0,0,null,0]
[null,null,null,null,null,null,null,{"$f":"'BUDGET AJU APPROUVE'!$L$43","v":0},0,0,0,null,0]
[null,null,null,null,null,null,null,{"$f":"'BUDGET AJU APPROUVE'!$L$43","v":0},0,0,0,null,0]
[null,null,null,null,null,null,null,{"$f":"'BUDGET AJU APPROUVE'!$L$43","v":0},0,0,0,null,0]
[null,null,null,null,null,null,null,{"$f":"'BUDGET AJU APPROUVE'!$L$43","v":0},0,0,0,null,0]
[null,null,null,null,null,null,null,{"$f":"'BUDGET AJU APPROUVE'!$L$43","v":0},0,0,0,null,0]
[null,null,null,null,null,null,null,{"$f":"'BUDGET AJU APPROUVE'!$L$43","v":0},0,0,0,null,0]
[null,null,null,null,null,null,"TOTAL",null,{"$f":"SUM(I84:I95)","v":0},{"$f":"SUM(J84:J95)","v":0},null,null,{"$f":"SUM(M84:M95)","v":0},{"$f":"SUM(N84:N95)","v":0}]
[null,null,null,{"$f":"CONCATENATE('BUDGET AJU APPROUVE'!C44,'BUDGET AJU APPROUVE'!E44)","v":"Choisissez dans la liste Frais de fonctionnement directs "},null,null,null,{"$f":"'BUDGET AJU APPROUVE'!$L$44","v":0},{"$f":"G97*H97","v":0},0,{"$f":"IFERROR(+J97/G97,0)","v":0},null,{"$f":"I97-N97","v":0}]
[null,null,null,null,null,null,null,{"$f":"'BUDGET AJU APPROUVE'!$L$44","v":0},{"$f":"G98*H98","v":0},0,0,null,{"$f":"I98-N98","v":0}]
[null,null,null,null,null,null,null,{"$f":"'BUDGET AJU APPROUVE'!$L$44","v":0},0,0,0,null,0]
[null,null,null,null,null,null,null,{"$f":"'BUDGET AJU APPROUVE'!$L$44","v":0},0,0,0,null,{"$f":"I100-N100","v":0}]
[null,null,null,null,null,null,null,{"$f":"'BUDGET AJU APPROUVE'!$L$44","v":0},{"$f":"G101*H101","v":0},{"$f":"G101-I101","v":0},{"$f":"IFERROR(+J101/G101,0)","v":0}]
[null,null,null,null,null,null,null,{"$f":"'BUDGET AJU APPROUVE'!$L$44","v":0},0,0,0,null,0]
[null,null,null,null,null,null,null,{"$f":"'BUDGET AJU APPROUVE'!$L$44","v":0},0,0,0,null,0]
[null,null,null,null,null,null,null,{"$f":"'BUDGET AJU APPROUVE'!$L$44","v":0},0,0,0,null,0]
[null,null,null,null,null,null,null,{"$f":"'BUDGET AJU APPROUVE'!$L$44","v":0},0,0,0,null,0]
[null,null,null,null,null,null,null,{"$f":"'BUDGET AJU APPROUVE'!$L$44","v":0},0,0,0,null,0]
[null,null,null,null,null,null,null,{"$f":"'BUDGET AJU APPROUVE'!$L$44","v":0},0,0,0,null,0]
[null,null,null,null,null,null,null,{"$f":"'BUDGET AJU APPROUVE'!$L$44","v":0},0,0,0,null,0]
[null,null,null,null,null,null,"TOTAL",null,{"$f":"SUM(I97:I108)","v":0},{"$f":"SUM(J97:J108)","v":0},null,null,{"$f":"SUM(M97:M108)","v":0},{"$f":"SUM(N97:N108)","v":0}]
[null,null,null,{"$f":"CONCATENATE('BUDGET AJU APPROUVE'!C45,'BUDGET AJU APPROUVE'!E45)","v":"Choisissez dans la liste Frais de fonctionnement directs "},null,null,null,{"$f":"'BUDGET AJU APPROUVE'!$L$45","v":0},{"$f":"G110*H110","v":0},0,{"$f":"IFERROR(+J110/G110,0)","v":0},null,{"$f":"I110-N110","v":0}]
[null,null,null,null,null,null,null,{"$f":"'BUDGET AJU APPROUVE'!$L$45","v":0},{"$f":"G111*H111","v":0},0,0,null,{"$f":"I111-N111","v":0}]
[null,null,null,null,null,null,null,{"$f":"'BUDGET AJU APPROUVE'!$L$45","v":0},0,0,0,null,0]
[null,null,null,null,null,null,null,{"$f":"'BUDGET AJU APPROUVE'!$L$45","v":0},0,0,0,null,{"$f":"I113-N113","v":0}]
[null,null,null,null,null,null,null,{"$f":"'BUDGET AJU APPROUVE'!$L$45","v":0},{"$f":"G114*H114","v":0},{"$f":"G114-I114","v":0},{"$f":"IFERROR(+J114/G114,0)","v":0}]
[null,null,null,null,null,null,null,{"$f":"'BUDGET AJU APPROUVE'!$L$45","v":0},0,0,0,null,0]
[null,null,null,null,null,null,null,{"$f":"'BUDGET AJU APPROUVE'!$L$45","v":0},0,0,0,null,0]
[null,null,null,null,null,null,null,{"$f":"'BUDGET AJU APPROUVE'!$L$45","v":0},0,0,0,null,0]
[null,null,null,null,null,null,null,{"$f":"'BUDGET AJU APPROUVE'!$L$45","v":0},0,0,0,null,0]
[null,null,null,null,null,null,null,{"$f":"'BUDGET AJU APPROUVE'!$L$45","v":0},0,0,0,null,0]
[null,null,null,null,null,null,null,{"$f":"'BUDGET AJU APPROUVE'!$L$45","v":0},0,0,0,null,0]
[null,null,null,null,null,null,null,{"$f":"'BUDGET AJU APPROUVE'!$L$45","v":0},0,0,0,null,0]
[null,null,null,null,null,null,"TOTAL",null,{"$f":"SUM(I110:I121)","v":0},{"$f":"SUM(J110:J121)","v":0},null,null,{"$f":"SUM(M110:M121)","v":0},{"$f":"SUM(N110:N121)","v":0}]
[null,null,null,{"$f":"CONCATENATE('BUDGET AJU APPROUVE'!C46,'BUDGET AJU APPROUVE'!E46)","v":"Autre : (compléter soi-même) "},null,null,null,{"$f":"'BUDGET AJU APPROUVE'!$L$46","v":0},{"$f":"G123*H123","v":0},0,{"$f":"IFERROR(+J123/G123,0)","v":0},null,{"$f":"I123-N123","v":0}]
[null,null,null,null,null,null,null,{"$f":"'BUDGET AJU APPROUVE'!$L$46","v":0},{"$f":"G124*H124","v":0},0,0,null,{"$f":"I124-N124","v":0}]
[null,null,null,null,null,null,null,{"$f":"'BUDGET AJU APPROUVE'!$L$46","v":0},0,0,0,null,0]
[null,null,null,null,null,null,null,{"$f":"'BUDGET AJU APPROUVE'!$L$46","v":0},0,0,0,null,{"$f":"I126-N126","v":0}]
[null,null,null,null,null,null,null,{"$f":"'BUDGET AJU APPROUVE'!$L$46","v":0},{"$f":"G127*H127","v":0},{"$f":"G127-I127","v":0},{"$f":"IFERROR(+J127/G127,0)","v":0}]
[null,null,null,null,null,null,null,{"$f":"'BUDGET AJU APPROUVE'!$L$46","v":0},0,0,0,null,0]
[null,null,null,null,null,null,null,{"$f":"'BUDGET AJU APPROUVE'!$L$46","v":0},0,0,0,null,0]
[null,null,null,null,null,null,null,{"$f":"'BUDGET AJU APPROUVE'!$L$46","v":0},0,0,0,null,0]
[null,null,null,null,null,null,null,{"$f":"'BUDGET AJU APPROUVE'!$L$46","v":0},0,0,0,null,0]
[null,null,null,null,null,null,null,{"$f":"'BUDGET AJU APPROUVE'!$L$46","v":0},0,0,0,null,0]
[null,null,null,null,null,null,null,{"$f":"'BUDGET AJU APPROUVE'!$L$46","v":0},0,0,0,null,0]
[null,null,null,null,null,null,null,{"$f":"'BUDGET AJU APPROUVE'!$L$46","v":0},0,0,0,null,0]
[null,null,null,null,null,null,"TOTAL",null,{"$f":"SUM(I123:I134)","v":0},{"$f":"SUM(J123:J134)","v":0},null,null,{"$f":"SUM(M123:M134)","v":0},{"$f":"SUM(N123:N134)","v":0}]
[null,null,null,{"$f":"CONCATENATE('BUDGET AJU APPROUVE'!C47,'BUDGET AJU APPROUVE'!E47)","v":"Autre : (compléter soi-même) "},null,null,null,{"$f":"'BUDGET AJU APPROUVE'!$L$47","v":0},{"$f":"G136*H136","v":0},0,{"$f":"IFERROR(+J136/G136,0)","v":0},null,{"$f":"I136-N136","v":0}]
[null,null,null,null,null,null,null,{"$f":"'BUDGET AJU APPROUVE'!$L$47","v":0},{"$f":"G137*H137","v":0},0,0,null,{"$f":"I137-N137","v":0}]
[null,null,null,null,null,null,null,{"$f":"'BUDGET AJU APPROUVE'!$L$47","v":0},0,0,0,null,0]
[null,null,null,null,null,null,null,{"$f":"'BUDGET AJU APPROUVE'!$L$47","v":0},0,0,0,null,{"$f":"I139-N139","v":0}]
[null,null,null,null,null,null,null,{"$f":"'BUDGET AJU APPROUVE'!$L$47","v":0},{"$f":"G140*H140","v":0},{"$f":"G140-I140","v":0},{"$f":"IFERROR(+J140/G140,0)","v":0}]
[null,null,null,null,null,null,null,{"$f":"'BUDGET AJU APPROUVE'!$L$47","v":0},0,0,0,null,0]
[null,null,null,null,null,null,null,{"$f":"'BUDGET AJU APPROUVE'!$L$47","v":0},0,0,0,null,0]
[null,null,null,null,null,null,null,{"$f":"'BUDGET AJU APPROUVE'!$L$47","v":0},0,0,0,null,0]
[null,null,null,null,null,null,null,{"$f":"'BUDGET AJU APPROUVE'!$L$47","v":0},0,0,0,null,0]
[null,null,null,null,null,null,null,{"$f":"'BUDGET AJU APPROUVE'!$L$47","v":0},0,0,0,null,0]
[null,null,null,null,null,null,null,{"$f":"'BUDGET AJU APPROUVE'!$L$47","v":0},0,{"$f":"G146-I146","v":0},0,null,0]
[null,null,null,null,null,null,null,{"$f":"'BUDGET AJU APPROUVE'!$L$47","v":0},0,0,0,null,0]
[null,null,null,null,null,null,"TOTAL",null,{"$f":"SUM(I136:I147)","v":0},{"$f":"SUM(J136:J147)","v":0},null,null,{"$f":"SUM(M136:M147)","v":0},{"$f":"SUM(N136:N147)","v":0}]
["TOTAL BUDGET APPROUVE",null,null,{"$f":"'BUDGET AJU APPROUVE'!K48","v":0},null,null,"TOTAL FRAIS REELS",null,{"$f":"I18+I31+I44+I57+I70+I83+I96+I109+I135+I148+I122","v":0},{"$f":"J18+J31+J44+J57+J70+J83+J96+J109+J122+J135+J148","v":0},null,null,{"$f":"M18+M44+M57+M70+M96+M109+M135+M148+M31+M122","v":0},{"$f":"N18+N44+N57+N70+N96+N109+N135+N148+N31+N122","v":0}]
[]
[]
[]
["2. Checklist Frais de fonctionnement directs"]
[]
[null,"Est-ce que les pièces justificatives concernant les frais de fonctionnement directs sont présentes "]
[null,"Est-ce que la dépense est faite dans la période de subsidiabilité? "]
[null,"Est-ce que la motivation de la dépense est bien formulé de façon à faire le lien avec le projet"]

{"sheet":"Frais de fctment indirects","index":16,"n_rows":170,"n_cols":17,"rows_kept":170,"cut":false,"hidden":true,"merged":[[171,1,171,11],[172,1,172,11],[83,3,94,3],[96,3,107,3],[109,3,120,3],[122,3,133,3],[135,3,146,3],[161,0,162,2],[161,3,162,3],[161,6,162,7],[161,5,162,5],[148,3,159,3],[167,1,167,11],[168,1,168,11],[169,1,169,11],[170,1,170,11],[0,13,2,16],[161,16,162,16],[165,0,166,10],[70,3,81,3],[5,3,16,3],[18,3,29,3],[31,3,42,3],[44,3,55,3],[57,3,68,3],[161,13,162,13],[161,14,162,14],[161,15,162,15],[161,8,162,8],[161,10,162,10]]}
["Frais de fonctionnement indirects",null,null,null,null,"Tous les chiffres doivent pouvoir être facilement retrouvés dans les preuves fournies.Si pas, veuillez fournir davantage d'explications dans les remarques",null,null,null,null,null,null,null,"INPUT FEDASIL"]
[]
["1. Détail frais"]
[]
["N° doc.","Date facture","Code du projet","Sous-rubrique","Nom du fournisseur","Une brève description pour les dépenses < 500 euros et une description et motivation plus détaillée pour les dépenses > 500 euros.","Total montant de la facture","% financement Fedasil","Montant du financement Fedasil","Explication et calcul de la clé de répartition","Autres sources de financement dépenses réelles","% autres sources",null,"Subsidiables Fedasil","Non subsidiable","Remarques Fedasil après contrôle","Info OPE FEDASIL"]
[null,null,null,{"$f":"'BUDGET AJU APPROUVE'!C50","v":"Choisissez dans la liste Frais de fonctionnement indirects"},null,null,null,{"$f":"'BUDGET AJU APPROUVE'!$L$50","v":0},{"$f":"G6*H6","v":0},null,{"$f":"G6-I6","v":0},{"$f":"IFERROR(+K6/H6,0)","v":0},null,{"$f":"I6-O6","v":0}]
[null,null,null,null,null,null,null,{"$f":"'BUDGET AJU APPROUVE'!$L$50","v":0},{"$f":"G7*H7","v":0},null,{"$f":"G7-I7","v":0},0,null,{"$f":"I7-O7","v":0}]
[null,null,null,null,null,null,null,{"$f":"'BUDGET AJU APPROUVE'!$L$50","v":0},0,null,0,0,null,0]
[null,null,null,null,null,null,null,{"$f":"'BUDGET AJU APPROUVE'!$L$50","v":0},0,null,0,0,null,0]
[null,null,null,null,null,null,null,{"$f":"'BUDGET AJU APPROUVE'!$L$50","v":0},0,null,0,0,null,0]
[null,null,null,null,null,null,null,{"$f":"'BUDGET AJU APPROUVE'!$L$50","v":0},0,null,0,0,null,0]
[null,null,null,null,null,null,null,{"$f":"'BUDGET AJU APPROUVE'!$L$50","v":0},0,null,0,0,null,0]
[null,null,null,null,null,null,null,{"$f":"'BUDGET AJU APPROUVE'!$L$50","v":0},{"$f":"G13*H13","v":0},null,{"$f":"G13-I13","v":0},{"$f":"IFERROR(+K13/H13,0)","v":0}]
[null,null,null,null,null,null,null,{"$f":"'BUDGET AJU APPROUVE'!$L$50","v":0},0,null,0,0,null,0]
[null,null,null,null,null,null,null,{"$f":"'BUDGET AJU APPROUVE'!$L$50","v":0},0,null,0,0,null,0]
[null,null,null,null,null,null,null,{"$f":"'BUDGET AJU APPROUVE'!$L$50","v":0},0,null,0,0,null,0]
[null,null,null,null,null,null,null,{"$f":"'BUDGET AJU APPROUVE'!$L$50","v":0},0,null,0,0,null,0]
[null,null,null,null,null,null,"TOTAL",null,{"$f":"SUM(I6:I17)","v":0},null,{"$f":"SUM(K6:K17)","v":0},null,null,{"$f":"SUM(N6:N17)","v":0},{"$f":"SUM(O6:O17)","v":0}]
[null,null,null,{"$f":"'BUDGET AJU APPROUVE'!C51","v":"Choisissez dans la liste Frais de fonctionnement indirects"},null,null,null,{"$f":"'BUDGET AJU APPROUVE'!$L$51","v":0},{"$f":"G19*H19","v":0},null,{"$f":"G19-I19","v":0},{"$f":"IFERROR(+K19/H19,0)","v":0},null,{"$f":"I19-O19","v":0}]
[null,null,null,null,null,null,null,{"$f":"'BUDGET AJU APPROUVE'!$L$51","v":0},0,null,{"$f":"G20-I20","v":0},0,null,{"$f":"I20-O20","v":0}]
[null,null,null,null,null,null,null,{"$f":"'BUDGET AJU APPROUVE'!$L$51","v":0},0,null,0,0,null,0]
[null,null,null,null,null,null,null,{"$f":"'BUDGET AJU APPROUVE'!$L$51","v":0},0,null,0,0,null,0]
[null,null,null,null,null,null,null,{"$f":"'BUDGET AJU APPROUVE'!$L$51","v":0},0,null,0,0,null,0]
[null,null,null,null,null,null,null,{"$f":"'BUDGET AJU APPROUVE'!$L$51","v":0},{"$f":"G24*H24","v":0},null,{"$f":"G24-I24","v":0},{"$f":"IFERROR(+K24/H24,0)","v":0}]
[null,null,null,null,null,null,null,{"$f":"'BUDGET AJU APPROUVE'!$L$51","v":0},0,null,0,0,null,0]
[null,null,null,null,null,null,null,{"$f":"'BUDGET AJU APPROUVE'!$L$51","v":0},0,null,0,0,null,0]
[null,null,null,null,null,null,null,{"$f":"'BUDGET AJU APPROUVE'!$L$51","v":0},0,null,0,0,null,0]
[null,null,null,null,null,null,null,{"$f":"'BUDGET AJU APPROUVE'!$L$51","v":0},0,null,0,0,null,0]
[null,null,null,null,null,null,null,{"$f":"'BUDGET AJU APPROUVE'!$L$51","v":0},0,null,0,0,null,0]
[null,null,null,null,null,null,null,{"$f":"'BUDGET AJU APPROUVE'!$L$51","v":0},0,null,0,0,null,0]
[null,null,null,null,null,null,"TOTAL",null,{"$f":"SUM(I19:I30)","v":0},null,{"$f":"SUM(K19:K30)","v":0},null,null,{"$f":"SUM(N19:N30)","v":0},{"$f":"SUM(O19:O30)","v":0}]
[null,null,null,{"$f":"'BUDGET AJU APPROUVE'!C52","v":"Choisissez dans la liste Frais de fonctionnement indirects"},null,null,null,{"$f":"'BUDGET AJU APPROUVE'!$L$52","v":0},{"$f":"G32*H32","v":0},null,{"$f":"G32-I32","v":0},{"$f":"IFERROR(+K32/H32,0)","v":0},null,{"$f":"I32-O32","v":0}]
[null,null,null,null,null,null,null,{"$f":"'BUDGET AJU APPROUVE'!$L$52","v":0},{"$f":"G33*H33","v":0},null,{"$f":"G33-I33","v":0},0,null,{"$f":"I33-O33","v":0}]
[null,null,null,null,null,null,null,{"$f":"'BUDGET AJU APPROUVE'!$L$52","v":0},0,null,0,0,null,0]
[null,null,null,null,null,null,null,{"$f":"'BUDGET AJU APPROUVE'!$L$52","v":0},0,null,0,0,null,0]
[null,null,null,null,null,null,null,{"$f":"'BUDGET AJU APPROUVE'!$L$52","v":0},0,null,0,0,null,0]
[null,null,null,null,null,null,null,{"$f":"'BUDGET AJU APPROUVE'!$L$52","v":0},{"$f":"G37*H37","v":0},null,{"$f":"G37-I37","v":0},{"$f":"IFERROR(+K37/H37,0)","v":0}]
[null,null,null,null,null,null,null,{"$f":"'BUDGET AJU APPROUVE'!$L$52","v":0},0,null,0,0,null,0]
[null,null,null,null,null,null,null,{"$f":"'BUDGET AJU APPROUVE'!$L$52","v":0},0,null,0,0,null,0]
[null,null,null,null,null,null,null,{"$f":"'BUDGET AJU APPROUVE'!$L$52","v":0},0,null,0,0,null,0]
[null,null,null,null,null,null,null,{"$f":"'BUDGET AJU APPROUVE'!$L$52","v":0},0,null,0,0,null,0]
[null,null,null,null,null,null,null,{"$f":"'BUDGET AJU APPROUVE'!$L$52","v":0},0,null,0,0,null,0]
[null,null,null,null,null,null,null,{"$f":"'BUDGET AJU APPROUVE'!$L$52","v":0},0,null,0,0,null,0]
[null,null,null,null,null,null,"TOTAL",null,{"$f":"SUM(I32:I43)","v":0},null,{"$f":"SUM(K32:K43)","v":0},null,null,{"$f":"SUM(N32:N43)","v":0},{"$f":"SUM(O32:O43)","v":0}]
[null,null,null,{"$f":"'BUDGET AJU APPROUVE'!C53","v":"Choisissez dans la liste Frais de fonctionnement indirects"},null,null,null,{"$f":"'BUDGET AJU APPROUVE'!$L$53","v":0},{"$f":"G45*H45","v":0},null,{"$f":"G45-I45","v":0},{"$f":"IFERROR(+K45/H45,0)","v":0},null,{"$f":"I45-O45","v":0}]
[null,null,null,null,null,null,null,{"$f":"'BUDGET AJU APPROUVE'!$L$53","v":0},0,null,{"$f":"G46-I46","v":0},0,null,{"$f":"I46-O46","v":0}]
[null,null,null,null,null,null,null,{"$f":"'BUDGET AJU APPROUVE'!$L$53","v":0},0,null,0,0,null,0]
[null,null,null,null,null,null,null,{"$f":"'BUDGET AJU APPROUVE'!$L$53","v":0},0,null,0,0,null,0]
[null,null,null,null,null,null,null,{"$f":"'BUDGET AJU APPROUVE'!$L$53","v":0},{"$f":"G49*H49","v":0},null,{"$f":"G49-I49","v":0},{"$f":"IFERROR(+K49/H49,0)","v":0}]
[null,null,null,null,null,null,null,{"$f":"'BUDGET AJU APPROUVE'!$L$53","v":0},0,null,0,0,null,0]
[null,null,null,null,null,null,null,{"$f":"'BUDGET AJU APPROUVE'!$L$53","v":0},0,null,0,0,null,0]
[null,null,null,null,null,null,null,{"$f":"'BUDGET AJU APPROUVE'!$L$53","v":0},0,null,0,0,null,0]
[null,null,null,null,null,null,null,{"$f":"'BUDGET AJU APPROUVE'!$L$53","v":0},0,null,0,0,null,0]
[null,null,null,null,null,null,null,{"$f":"'BUDGET AJU APPROUVE'!$L$53","v":0},0,null,0,0,null,0]
[null,null,null,null,null,null,null,{"$f":"'BUDGET AJU APPROUVE'!$L$53","v":0},0,null,0,0,null,0]
[null,null,null,null,null,null,null,{"$f":"'BUDGET AJU APPROUVE'!$L$53","v":0},0,null,0,0,null,0]
[null,null,null,null,null,null,"TOTAL",null,{"$f":"SUM(I45:I56)","v":0},null,{"$f":"SUM(K45:K56)","v":0},null,null,{"$f":"SUM(N45:N56)","v":0},{"$f":"SUM(O45:O56)","v":0}]
[null,null,null,{"$f":"'BUDGET AJU APPROUVE'!C54","v":"Choisissez dans la liste Frais de fonctionnement indirects"},null,null,null,{"$f":"'BUDGET AJU APPROUVE'!$L$54","v":0},{"$f":"G58*H58","v":0},null,{"$f":"G58-I58","v":0},{"$f":"IFERROR(+K58/H58,0)","v":0},null,{"$f":"I58-O58","v":0}]
[null,null,null,null,null,null,null,{"$f":"'BUDGET AJU APPROUVE'!$L$54","v":0},{"$f":"G59*H59","v":0},null,{"$f":"G59-I59","v":0},0,null,{"$f":"I59-O59","v":0}]
[null,null,null,null,null,null,null,{"$f":"'BUDGET AJU APPROUVE'!$L$54","v":0},0,null,0,0,null,0]
[null,null,null,null,null,null,null,{"$f":"'BUDGET AJU APPROUVE'!$L$54","v":0},{"$f":"G61*H61","v":0},null,{"$f":"G61-I61","v":0},{"$f":"IFERROR(+K61/H61,0)","v":0}]
[null,null,null,null,null,null,null,{"$f":"'BUDGET AJU APPROUVE'!$L$54","v":0},0,null,0,0,null,0]
[null,null,null,null,null,null,null,{"$f":"'BUDGET AJU APPROUVE'!$L$54","v":0},0,null,0,0,null,0]
[null,null,null,null,null,null,null,{"$f":"'BUDGET AJU APPROUVE'!$L$54","v":0},0,null,0,0,null,0]
[null,null,null,null,null,null,null,{"$f":"'BUDGET AJU APPROUVE'!$L$54","v":0},0,null,0,0,null,0]
[null,null,null,null,null,null,null,{"$f":"'BUDGET AJU APPROUVE'!$L$54","v":0},0,null,0,0,null,0]
[null,null,null,null,null,null,null,{"$f":"'BUDGET AJU APPROUVE'!$L$54","v":0},0,null,0,0,null,0]
[null,null,null,null,null,null,null,{"$f":"'BUDGET AJU APPROUVE'!$L$54","v":0},0,null,0,0,null,0]
[null,null,null,null,null,null,null,{"$f":"'BUDGET AJU APPROUVE'!$L$54","v":0},0,null,0,0,null,0]
[null,null,null,null,null,null,"TOTAL",null,{"$f":"SUM(I58:I69)","v":0},null,{"$f":"SUM(K58:K69)","v":0},null,null,{"$f":"SUM(N58:N69)","v":0},{"$f":"SUM(O58:O69)","v":0}]
[null,null,null,{"$f":"'BUDGET AJU APPROUVE'!C55","v":"Choisissez dans la liste Frais de fonctionnement indirects"},null,null,null,{"$f":"'BUDGET AJU APPROUVE'!$L$55","v":0},{"$f":"G71*H71","v":0},null,{"$f":"G71-I71","v":0},{"$f":"IFERROR(+K71/H71,0)","v":0},null,{"$f":"I71-O71","v":0}]
[null,null,null,null,null,null,null,{"$f":"'BUDGET AJU APPROUVE'!$L$55","v":0},0,null,{"$f":"G72-I72","v":0},0,null,{"$f":"I72-O72","v":0}]
[null,null,null,null,null,null,null,{"$f":"'BUDGET AJU APPROUVE'!$L$55","v":0},{"$f":"G73*H73","v":0},null,{"$f":"G73-I73","v":0},{"$f":"IFERROR(+K73/H73,0)","v":0}]
[null,null,null,null,null,null,null,{"$f":"'BUDGET AJU APPROUVE'!$L$55","v":0},0,null,0,0,null,0]
[null,null,null,null,null,null,null,{"$f":"'BUDGET AJU APPROUVE'!$L$55","v":0},0,null,0,0,null,0]
[null,null,null,null,null,null,null,{"$f":"'BUDGET AJU APPROUVE'!$L$55","v":0},0,null,0,0,null,0]
[null,null,null,null,null,null,null,{"$f":"'BUDGET AJU APPROUVE'!$L$55","v":0},0,null,0,0,null,0]
[null,null,null,null,null,null,null,{"$f":"'BUDGET AJU APPROUVE'!$L$55","v":0},0,null,0,0,null,0]
[null,null,null,null,null,null,null,{"$f":"'BUDGET AJU APPROUVE'!$L$55","v":0},0,null,0,0,null,0]
[null,null,null,null,null,null,null,{"$f":"'BUDGET AJU APPROUVE'!$L$55","v":0},0,null,0,0,null,0]
[null,null,null,null,null,null,null,{"$f":"'BUDGET AJU APPROUVE'!$L$55","v":0},0,null,0,0,null,0]
[null,null,null,null,null,null,null,{"$f":"'BUDGET AJU APPROUVE'!$L$55","v":0},0,null,0,0,null,0]
[null,null,null,null,null,null,"TOTAL",null,{"$f":"SUM(I71:I82)","v":0},null,{"$f":"SUM(K71:K82)","v":0},null,null,{"$f":"SUM(N71:N82)","v":0},{"$f":"SUM(O71:O82)","v":0}]
[null,null,null,{"$f":"'BUDGET AJU APPROUVE'!C56","v":"Choisissez dans la liste Frais de fonctionnement indirects"},null,null,null,{"$f":"'BUDGET AJU APPROUVE'!$L$56","v":0},{"$f":"G84*H84","v":0},null,{"$f":"G84-I84","v":0},{"$f":"IFERROR(+K84/H84,0)","v":0},null,{"$f":"I84-O84","v":0}]
[null,null,null,null,null,null,null,{"$f":"'BUDGET AJU APPROUVE'!$L$56","v":0},{"$f":"G85*H85","v":0},null,{"$f":"G85-I85","v":0},0,null,{"$f":"I85-O85","v":0}]
[null,null,null,null,null,null,null,{"$f":"'BUDGET AJU APPROUVE'!$L$56","v":0},0,null,0,0,null,0]
[null,null,null,null,null,null,null,{"$f":"'BUDGET AJU APPROUVE'!$L$56","v":0},{"$f":"G87*H87","v":0},null,{"$f":"G87-I87","v":0},{"$f":"IFERROR(+K87/H87,0)","v":0}]
[null,null,null,null,null,null,null,{"$f":"'BUDGET AJU APPROUVE'!$L$56","v":0},0,null,0,0,null,0]
[null,null,null,null,null,null,null,{"$f":"'BUDGET AJU APPROUVE'!$L$56","v":0},0,null,0,0,null,0]
[null,null,null,null,null,null,null,{"$f":"'BUDGET AJU APPROUVE'!$L$56","v":0},0,null,0,0,null,0]
[null,null,null,null,null,null,null,{"$f":"'BUDGET AJU APPROUVE'!$L$56","v":0},0,null,0,0,null,0]
[null,null,null,null,null,null,null,{"$f":"'BUDGET AJU APPROUVE'!$L$56","v":0},0,null,0,0,null,0]
[null,null,null,null,null,null,null,{"$f":"'BUDGET AJU APPROUVE'!$L$56","v":0},0,null,0,0,null,0]
[null,null,null,null,null,null,null,{"$f":"'BUDGET AJU APPROUVE'!$L$56","v":0},0,null,0,0,null,0]
[null,null,null,null,null,null,null,{"$f":"'BUDGET AJU APPROUVE'!$L$56","v":0},0,null,0,0,null,0]
[null,null,null,null,null,null,"TOTAL",null,{"$f":"SUM(I84:I95)","v":0},null,{"$f":"SUM(K84:K95)","v":0},null,null,{"$f":"SUM(N84:N95)","v":0},{"$f":"SUM(O84:O95)","v":0}]
[null,null,null,{"$f":"'BUDGET AJU APPROUVE'!C57","v":"Choisissez dans la liste Frais de fonctionnement indirects"},null,null,null,{"$f":"'BUDGET AJU APPROUVE'!$L$57","v":0},{"$f":"G97*H97","v":0},null,{"$f":"G97-I97","v":0},{"$f":"IFERROR(+K97/H97,0)","v":0},null,{"$f":"I97-O97","v":0}]
[null,null,null,null,null,null,null,{"$f":"'BUDGET AJU APPROUVE'!$L$57","v":0},0,null,{"$f":"G98-I98","v":0},0,null,{"$f":"I98-O98","v":0}]
[null,null,null,null,null,null,null,{"$f":"'BUDGET AJU APPROUVE'!$L$57","v":0},0,null,0,0,null,0]
[null,null,null,null,null,null,null,{"$f":"'BUDGET AJU APPROUVE'!$L$57","v":0},{"$f":"G100*H100","v":0},null,{"$f":"G100-I100","v":0},{"$f":"IFERROR(+K100/H100,0)","v":0}]
[null,null,null,null,null,null,null,{"$f":"'BUDGET AJU APPROUVE'!$L$57","v":0},0,null,0,0,null,0]
[null,null,null,null,null,null,null,{"$f":"'BUDGET AJU APPROUVE'!$L$57","v":0},0,null,0,0,null,0]
[null,null,null,null,null,null,null,{"$f":"'BUDGET AJU APPROUVE'!$L$57","v":0},0,null,0,0,null,0]
[null,null,null,null,null,null,null,{"$f":"'BUDGET AJU APPROUVE'!$L$57","v":0},0,null,0,0,null,0]
[null,null,null,null,null,null,null,{"$f":"'BUDGET AJU APPROUVE'!$L$57","v":0},0,null,0,0,null,0]
[null,null,null,null,null,null,null,{"$f":"'BUDGET AJU APPROUVE'!$L$57","v":0},0,null,0,0,null,0]
[null,null,null,null,null,null,null,{"$f":"'BUDGET AJU APPROUVE'!$L$57","v":0},0,null,0,0,null,0]
[null,null,null,null,null,null,null,{"$f":"'BUDGET AJU APPROUVE'!$L$57","v":0},0,null,0,0,null,0]
[null,null,null,null,null,null,"TOTAL",null,{"$f":"SUM(I97:I108)","v":0},null,{"$f":"SUM(K97:K108)","v":0},null,null,{"$f":"SUM(N97:N108)","v":0},{"$f":"SUM(O97:O108)","v":0}]
[null,null,null,{"$f":"'BUDGET AJU APPROUVE'!C58","v":"Choisissez dans la liste Frais de fonctionnement indirects"},null,null,null,{"$f":"'BUDGET AJU APPROUVE'!$L$58","v":0},{"$f":"G110*H110","v":0},null,{"$f":"G110-I110","v":0},{"$f":"IFERROR(+K110/H110,0)","v":0},null,{"$f":"I110-O110","v":0}]
[null,null,null,null,null,null,null,{"$f":"'BUDGET AJU APPROUVE'!$L$58","v":0},{"$f":"G111*H111","v":0},null,{"$f":"G111-I111","v":0},0,null,{"$f":"I111-O111","v":0}]
[null,null,null,null,null,null,null,{"$f":"'BUDGET AJU APPROUVE'!$L$58","v":0},0,null,0,0,null,0]
[null,null,null,null,null,null,null,{"$f":"'BUDGET AJU APPROUVE'!$L$58","v":0},0,null,0,0,null,0]
[null,null,null,null,null,null,null,{"$f":"'BUDGET AJU APPROUVE'!$L$58","v":0},{"$f":"G114*H114","v":0},null,{"$f":"G114-I114","v":0},{"$f":"IFERROR(+K114/H114,0)","v":0}]
[null,null,null,null,null,null,null,{"$f":"'BUDGET AJU APPROUVE'!$L$58","v":0},0,null,0,0,null,0]
[null,null,null,null,null,null,null,{"$f":"'BUDGET AJU APPROUVE'!$L$58","v":0},0,null,0,0,null,0]
[null,null,null,null,null,null,null,{"$f":"'BUDGET AJU APPROUVE'!$L$58","v":0},0,null,0,0,null,0]
[null,null,null,null,null,null,null,{"$f":"'BUDGET AJU APPROUVE'!$L$58","v":0},0,null,0,0,null,0]
[null,null,null,null,null,null,null,{"$f":"'BUDGET AJU APPROUVE'!$L$58","v":0},0,null,0,0,null,0]
[null,null,null,null,null,null,null,{"$f":"'BUDGET AJU APPROUVE'!$L$58","v":0},0,null,0,0,null,0]
[null,null,null,null,null,null,null,{"$f":"'BUDGET AJU APPROUVE'!$L$58","v":0},0,null,0,0,null,0]
[null,null,null,null,null,null,"TOTAL",null,{"$f":"SUM(I110:I121)","v":0},null,{"$f":"SUM(K110:K121)","v":0},null,null,{"$f":"SUM(N110:N121)","v":0},{"$f":"SUM(O110:O121)","v":0}]
[null,null,null,{"$f":"'BUDGET AJU APPROUVE'!C59","v":"Choisissez dans la liste Frais de fonctionnement indirects"},null,null,null,{"$f":"'BUDGET AJU APPROUVE'!$L$59","v":0},{"$f":"G123*H123","v":0},null,{"$f":"G123-I123","v":0},{"$f":"IFERROR(+K123/H123,0)","v":0},null,{"$f":"I123-O123","v":0}]
[null,null,null,null,null,null,null,{"$f":"'BUDGET AJU APPROUVE'!$L$59","v":0},0,null,{"$f":"G124-I124","v":0},0,null,{"$f":"I124-O124","v":0}]
[null,null,null,null,null,null,null,{"$f":"'BUDGET AJU APPROUVE'!$L$59","v":0},0,null,0,0,null,0]
[null,null,null,null,null,null,null,{"$f":"'BUDGET AJU APPROUVE'!$L$59","v":0},0,null,0,0,null,0]
[null,null,null,null,null,null,null,{"$f":"'BUDGET AJU APPROUVE'!$L$59","v":0},{"$f":"G127*H127","v":0},null,{"$f":"G127-I127","v":0},{"$f":"IFERROR(+K127/H127,0)","v":0}]
[null,null,null,null,null,null,null,{"$f":"'BUDGET AJU APPROUVE'!$L$59","v":0},0,null,0,0,null,0]
[null,null,null,null,null,null,null,{"$f":"'BUDGET AJU APPROUVE'!$L$59","v":0},0,null,0,0,null,0]
[null,null,null,null,null,null,null,{"$f":"'BUDGET AJU APPROUVE'!$L$59","v":0},0,null,0,0,null,0]
[null,null,null,null,null,null,null,{"$f":"'BUDGET AJU APPROUVE'!$L$59","v":0},0,null,0,0,null,0]
[null,null,null,null,null,null,null,{"$f":"'BUDGET AJU APPROUVE'!$L$59","v":0},0,null,0,0,null,0]
[null,null,null,null,null,null,null,{"$f":"'BUDGET AJU APPROUVE'!$L$59","v":0},0,null,0,0,null,0]
[null,null,null,null,null,null,null,{"$f":"'BUDGET AJU APPROUVE'!$L$59","v":0},0,null,0,0,null,0]
[null,null,null,null,null,null,"TOTAL",null,{"$f":"SUM(I123:I134)","v":0},null,{"$f":"SUM(K123:K134)","v":0},null,null,{"$f":"SUM(N123:N134)","v":0},{"$f":"SUM(O123:O134)","v":0}]
[null,null,null,{"$f":"'BUDGET AJU APPROUVE'!C60","v":"Autre : (compléter soi-même)"},null,null,null,{"$f":"'BUDGET AJU APPROUVE'!$L$60","v":0},{"$f":"G136*H136","v":0},null,{"$f":"G136-I136","v":0},{"$f":"IFERROR(+K136/H136,0)","v":0},null,{"$f":"I136-O136","v":0}]
[null,null,null,null,null,null,null,{"$f":"'BUDGET AJU APPROUVE'!$L$60","v":0},{"$f":"G137*H137","v":0},null,{"$f":"G137-I137","v":0},0,null,{"$f":"I137-O137","v":0}]
[null,null,null,null,null,null,null,{"$f":"'BUDGET AJU APPROUVE'!$L$60","v":0},0,null,0,0,null,0]
[null,null,null,null,null,null,null,{"$f":"'BUDGET AJU APPROUVE'!$L$60","v":0},0,null,0,0,null,0]
[null,null,null,null,null,null,null,{"$f":"'BUDGET AJU APPROUVE'!$L$60","v":0},{"$f":"G140*H140","v":0},null,{"$f":"G140-I140","v":0},{"$f":"IFERROR(+K140/H140,0)","v":0}]
[null,null,null,null,null,null,null,{"$f":"'BUDGET AJU APPROUVE'!$L$60","v":0},0,null,0,0,null,0]
[null,null,null,null,null,null,null,{"$f":"'BUDGET AJU APPROUVE'!$L$60","v":0},0,null,0,0,null,0]
[null,null,null,null,null,null,null,{"$f":"'BUDGET AJU APPROUVE'!$L$60","v":0},0,null,0,0,null,0]
[null,null,null,null,null,null,null,{"$f":"'BUDGET AJU APPROUVE'!$L$60","v":0},0,null,0,0,null,0]
[null,null,null,null,null,null,null,{"$f":"'BUDGET AJU APPROUVE'!$L$60","v":0},0,null,0,0,null,0]
[null,null,null,null,null,null,null,{"$f":"'BUDGET AJU APPROUVE'!$L$60","v":0},0,null,0,0,null,0]
[null,null,null,null,null,null,null,{"$f":"'BUDGET AJU APPROUVE'!$L$60","v":0},0,null,0,0,null,0]
[null,null,null,null,null,null,"TOTAL",null,{"$f":"SUM(I136:I147)","v":0},null,{"$f":"SUM(K136:K147)","v":0},null,null,{"$f":"SUM(N136:N147)","v":0},{"$f":"SUM(O136:O147)","v":0}]
[null,null,null,{"$f":"'BUDGET AJU APPROUVE'!C61","v":"Autre : (compléter soi-même)"},null,null,null,{"$f":"'BUDGET AJU APPROUVE'!$L$61","v":0},{"$f":"G149*H149","v":0},null,{"$f":"G149-I149","v":0},{"$f":"IFERROR(+K149/H149,0)","v":0},null,{"$f":"I149-O149","v":0}]
[null,null,null,null,null,null,null,{"$f":"'BUDGET AJU APPROUVE'!$L$61","v":0},0,null,{"$f":"G150-I150","v":0},0,null,{"$f":"I150-O150","v":0}]
[null,null,null,null,null,null,null,{"$f":"'BUDGET AJU APPROUVE'!$L$61","v":0},0,null,0,0,null,0]
[null,null,null,null,null,null,null,{"$f":"'BUDGET AJU APPROUVE'!$L$61","v":0},{"$f":"G152*H152","v":0},null,{"$f":"G152-I152","v":0},{"$f":"IFERROR(+K152/H152,0)","v":0}]
[null,null,null,null,null,null,null,{"$f":"'BUDGET AJU APPROUVE'!$L$61","v":0},0,null,0,0,null,0]
[null,null,null,null,null,null,null,{"$f":"'BUDGET AJU APPROUVE'!$L$61","v":0},0,null,0,0,null,0]
[null,null,null,null,null,null,null,{"$f":"'BUDGET AJU APPROUVE'!$L$61","v":0},0,null,0,0,null,0]
[null,null,null,null,null,null,null,{"$f":"'BUDGET AJU APPROUVE'!$L$61","v":0},0,null,0,0,null,0]
[null,null,null,null,null,null,null,{"$f":"'BUDGET AJU APPROUVE'!$L$61","v":0},0,null,0,0,null,0]
[null,null,null,null,null,null,null,{"$f":"'BUDGET AJU APPROUVE'!$L$61","v":0},0,null,0,0,null,0]
[null,null,null,null,null,null,null,{"$f":"'BUDGET AJU APPROUVE'!$L$61","v":0},0,null,0,0,null,0]
[null,null,null,null,null,null,null,{"$f":"'BUDGET AJU APPROUVE'!$L$61","v":0},0,null,0,0,null,0]
[null,null,null,null,null,null,"TOTAL",null,{"$f":"SUM(I149:I160)","v":0},null,{"$f":"SUM(K149:K160)","v":0},null,null,{"$f":"SUM(N149:N160)","v":0},{"$f":"SUM(O149:O160)","v":0}]
["TOTAL BUDGET APPROUVE",null,null,{"$f":"'BUDGET AJU APPROUVE'!K62","v":0},null,null,"TOTAL DES FRAIS REELS",null,{"$f":"I18+I31+I44+I57+I70+I83+I96+I109+I122+I135+I148+I161","v":0},null,{"$f":"K161+K148+K135+K122+K109+K96+K83+K70+K57+K44+K31+K18","v":0},null,null,{"$f":"N18+N44+N57+N70+N96+N109+N135+N161+N31+N122","v":0},{"$f":"O18+O44+O57+O70+O96+O109+O135+O161+O31+O122","v":0}]
[null,null,null,{"$f":"'BUDGET AJU APPROUVE'!K62","v":0}]
[]
[]
["2. Checklist Frais de fonctionnement indirects"]
[]
[null,"Est-ce que les pièces justificatives concernant les frais de fonctionnement indirects sont présentes "]
[null,"Est-ce que la dépense est faite dans la période de subsidiabilité? "]
[null,"Est-ce que la clé d'affectation est bien expliquée?"]

{"sheet":"Aperçu budget-dépenses","index":17,"n_rows":66,"n_cols":10,"rows_kept":66,"cut":false,"hidden":true,"merged":[[65,5,65,9],[63,2,63,3],[57,2,57,3],[58,2,58,3],[59,2,59,3],[61,2,61,3],[62,2,62,3],[60,2,60,3],[56,2,56,3],[48,2,48,3],[49,2,49,3],[50,2,50,3],[51,2,51,3],[52,2,52,3],[53,2,53,3],[54,2,54,3],[55,2,55,3],[33,2,33,3],[34,2,34,3],[35,2,35,3],[36,2,36,3],[10,2,10,3],[10,4,10,9],[11,2,11,3],[11,4,11,9],[32,2,32,3],[13,2,13,3],[14,2,14,3],[23,2,23,3],[24,2,24,3],[25,2,25,3],[26,2,26,3],[27,2,27,3],[28,2,28,3],[29,2,29,3],[30,2,30,3],[31,2,31,3],[7,2,7,3],[7,4,7,9],[8,2,8,3],[8,4,8,9],[9,2,9,3],[9,4,9,9]]}
[]
[]
[]
[null,null,null,"Toutes les cellules de C à F doivent être liées au budget AJU approuvé, nous devons peut-être quand même demander à ce qu'ils complètent eux-mêmes les dépenses réelles ?"]
[]
[]
[]
[null,null,{"$f":"'DEMANDE BUDGET AJU'!C8","v":"Date de la demande :"},null,{"$f":"'DEMANDE BUDGET AJU'!F8","v":"2020-09-11"}]
[null,null,"Bénéficiaire : ",null,{"$f":"'DEMANDE BUDGET AJU'!F9","v":0}]
[null,null,"Projet :",null,{"$f":"'DEMANDE BUDGET AJU'!F10","v":0}]
[null,null,"Personne de contact :",null,{"$f":"'DEMANDE BUDGET AJU'!F11","v":0}]
[null,null,"Durée du projet (nombre de mois) :",null,{"$f":"'DEMANDE BUDGET AJU'!F12","v":0}]
[]
[null,null,{"$f":"'DEMANDE BUDGET AJU'!C17","v":"Budget 2021"},null,"Montant total du projet","Subside approuvé par Fedasil","% Fedasil","Dépenses réelles","Dépenses réelles %","Delta"]
[null,null,"Personnel"]
[null,null,{"$f":"'BUDGET VS ACTUAL'!P16","v":"(nom à compléter)"},{"$f":"IF('BUDGET AJU APPROUVE'!D15=\"(fonction à compléter)\",'BUDGET INI APPROUVE'!D18,'BUDGET AJU APPROUVE'!D15)","v":"(fonction à compléter)"},{"$f":"'BUDGET VS ACTUAL'!V16","v":0},{"$f":"'BUDGET VS ACTUAL'!W16","v":0},{"$f":"IF(E16=0,0,F16/E16)","v":0},{"$f":"'BUDGET VS ACTUAL'!AL16","v":0},{"$f":"IF('BUDGET VS ACTUAL'!AM16=0,'BUDGET VS ACTUAL'!AG16,'BUDGET VS ACTUAL'!AM16)","v":0},{"$f":"H16-F16","v":0}]
[null,null,{"$f":"'BUDGET VS ACTUAL'!P17","v":"(nom à compléter)"},{"$f":"IF('BUDGET AJU APPROUVE'!D16=\"(fonction à compléter)\",'BUDGET INI APPROUVE'!D19,'BUDGET AJU APPROUVE'!D16)","v":"(fonction à compléter)"},{"$f":"'BUDGET VS ACTUAL'!V17","v":0},{"$f":"'BUDGET VS ACTUAL'!W17","v":0},{"$f":"IF(E17=0,0,F17/E17)","v":0},{"$f":"'BUDGET VS ACTUAL'!AL17","v":0},{"$f":"IF('BUDGET VS ACTUAL'!AM17=0,'BUDGET VS ACTUAL'!AG17,'BUDGET VS ACTUAL'!AM17)","v":0},{"$f":"H17-F17","v":0}]
[null,null,{"$f":"'BUDGET VS ACTUAL'!P18","v":"(nom à compléter)"},{"$f":"IF('BUDGET AJU APPROUVE'!D17=\"(fonction à compléter)\",'BUDGET INI APPROUVE'!D20,'BUDGET AJU APPROUVE'!D17)","v":"(fonction à compléter)"},{"$f":"'BUDGET VS ACTUAL'!V18","v":0},{"$f":"'BUDGET VS ACTUAL'!W18","v":0},{"$f":"IF(E18=0,0,F18/E18)","v":0},{"$f":"'BUDGET VS ACTUAL'!AL18","v":0},{"$f":"IF('BUDGET VS ACTUAL'!AM18=0,'BUDGET VS ACTUAL'!AG18,'BUDGET VS ACTUAL'!AM18)","v":0},0]
[null,null,{"$f":"'BUDGET VS ACTUAL'!P19","v":"(nom à compléter)"},{"$f":"IF('BUDGET AJU APPROUVE'!D18=\"(fonction à compléter)\",'BUDGET INI APPROUVE'!D21,'BUDGET AJU APPROUVE'!D18)","v":"(fonction à compléter)"},{"$f":"'BUDGET VS ACTUAL'!V19","v":0},{"$f":"'BUDGET VS ACTUAL'!W19","v":0},0,{"$f":"'BUDGET VS ACTUAL'!AL19","v":0},{"$f":"IF('BUDGET VS ACTUAL'!AM19=0,'BUDGET VS ACTUAL'!AG19,'BUDGET VS ACTUAL'!AM19)","v":0},0]
[null,null,{"$f":"'BUDGET VS ACTUAL'!P20","v":"(nom à compléter)"},{"$f":"IF('BUDGET AJU APPROUVE'!D19=\"(fonction à compléter)\",'BUDGET INI APPROUVE'!D22,'BUDGET AJU APPROUVE'!D19)","v":"(fonction à compléter)"},{"$f":"'BUDGET VS ACTUAL'!V20","v":0},{"$f":"'BUDGET VS ACTUAL'!W20","v":0},0,{"$f":"'BUDGET VS ACTUAL'!AL20","v":0},{"$f":"IF('BUDGET VS ACTUAL'!AM20=0,'BUDGET VS ACTUAL'!AG20,'BUDGET VS ACTUAL'!AM20)","v":0},0]
[null,null,{"$f":"'BUDGET VS ACTUAL'!P21","v":"(nom à compléter)"},{"$f":"IF('BUDGET AJU APPROUVE'!D20=\"(fonction à compléter)\",'BUDGET INI APPROUVE'!D23,'BUDGET AJU APPROUVE'!D20)","v":"(fonction à compléter)"},{"$f":"'BUDGET VS ACTUAL'!V21","v":0},{"$f":"'BUDGET VS ACTUAL'!W21","v":0},0,{"$f":"'BUDGET VS ACTUAL'!AL21","v":0},{"$f":"IF('BUDGET VS ACTUAL'!AM21=0,'BUDGET VS ACTUAL'!AG21,'BUDGET VS ACTUAL'!AM21)","v":0},0]
[null,null,{"$f":"'BUDGET VS ACTUAL'!P22","v":"(nom à compléter)"},{"$f":"IF('BUDGET AJU APPROUVE'!D21=\"(fonction à compléter)\",'BUDGET INI APPROUVE'!D24,'BUDGET AJU APPROUVE'!D21)","v":"(fonction à compléter)"},{"$f":"'BUDGET VS ACTUAL'!V22","v":0},{"$f":"'BUDGET VS ACTUAL'!W22","v":0},0,{"$f":"'BUDGET VS ACTUAL'!AL22","v":0},{"$f":"IF('BUDGET VS ACTUAL'!AM22=0,'BUDGET VS ACTUAL'!AG22,'BUDGET VS ACTUAL'!AM22)","v":0},0]
[null,null,{"$f":"'BUDGET VS ACTUAL'!P23","v":"(nom à compléter)"},{"$f":"IF('BUDGET AJU APPROUVE'!D22=\"(fonction à compléter)\",'BUDGET INI APPROUVE'!D25,'BUDGET AJU APPROUVE'!D22)","v":"(fonction à compléter)"},{"$f":"'BUDGET VS ACTUAL'!V23","v":0},{"$f":"'BUDGET VS ACTUAL'!W23","v":0},0,{"$f":"'BUDGET VS ACTUAL'!AL23","v":0},{"$f":"IF('BUDGET VS ACTUAL'!AM23=0,'BUDGET VS ACTUAL'!AG23,'BUDGET VS ACTUAL'!AM23)","v":0},0]
[null,null,"Total",null,null,{"$f":"SUM(F16:F23)","v":0},{"$f":"IF(E24=0,0,F24/E24)","v":0},{"$f":"SUM(H16:H23)","v":0},{"$f":"IF(G24=0,0,H24/G24)","v":0},{"$f":"H24-F24","v":0}]
[null,null,"Location"]
[null,null,{"$f":"'BUDGET VS ACTUAL'!P26","v":"(Objet/Bâtiment & Adresse à compléter)"},null,null,{"$f":"'BUDGET VS ACTUAL'!W26","v":0},0,{"$f":"'BUDGET VS ACTUAL'!AL26","v":0},{"$f":"IF('BUDGET VS ACTUAL'!AM26=0,'BUDGET VS ACTUAL'!AG26,'BUDGET VS ACTUAL'!AM26)","v":0},{"$f":"H26-F26","v":0}]
[null,null,{"$f":"'BUDGET VS ACTUAL'!P27","v":"(Objet/Bâtiment & Adresse à compléter)"},null,null,{"$f":"'BUDGET VS ACTUAL'!W27","v":0},0,{"$f":"'BUDGET VS ACTUAL'!AL27","v":0},{"$f":"IF('BUDGET VS ACTUAL'!AM27=0,'BUDGET VS ACTUAL'!AG27,'BUDGET VS ACTUAL'!AM27)","v":0},0]
[null,null,{"$f":"'BUDGET VS ACTUAL'!P28","v":"(Objet/Bâtiment & Adresse à compléter)"},null,null,{"$f":"'BUDGET VS ACTUAL'!W28","v":0},0,{"$f":"'BUDGET VS ACTUAL'!AL28","v":0},{"$f":"IF('BUDGET VS ACTUAL'!AM28=0,'BUDGET VS ACTUAL'!AG28,'BUDGET VS ACTUAL'!AM28)","v":0},0]
[null,null,{"$f":"'BUDGET VS ACTUAL'!P29","v":"(Objet/Bâtiment & Adresse à compléter)"},null,null,{"$f":"'BUDGET VS ACTUAL'!W29","v":0},0,{"$f":"'BUDGET VS ACTUAL'!AL29","v":0},{"$f":"IF('BUDGET VS ACTUAL'!AM29=0,'BUDGET VS ACTUAL'!AG29,'BUDGET VS ACTUAL'!AM29)","v":0},0]
[null,null,"Total",null,null,{"$f":"SUM(F26)","v":0},{"$f":"IF(E30=0,0,F30/E30)","v":0},{"$f":"SUM(H26:H29)","v":0},{"$f":"IF(G30=0,0,H30/G30)","v":0},{"$f":"H30-F30","v":0}]
[null,null,"Investissements (par ex. hardware et/ou software) "]
[null,null,{"$f":"'BUDGET VS ACTUAL'!P32","v":"(Compléter la description) "},null,null,{"$f":"'BUDGET VS ACTUAL'!W32","v":0},0,{"$f":"'BUDGET VS ACTUAL'!AL32","v":0},{"$f":"IF('BUDGET VS ACTUAL'!AM32=0,'BUDGET VS ACTUAL'!AG32,'BUDGET VS ACTUAL'!AM32)","v":0},{"$f":"H32-F32","v":0}]
[null,null,{"$f":"'BUDGET VS ACTUAL'!P33","v":"(à compléter) "},null,null,{"$f":"'BUDGET VS ACTUAL'!W33","v":0},0,{"$f":"'BUDGET VS ACTUAL'!AL33","v":0},{"$f":"IF('BUDGET VS ACTUAL'!AM33=0,'BUDGET VS ACTUAL'!AG33,'BUDGET VS ACTUAL'!AM33)","v":0},0]
[null,null,{"$f":"'BUDGET VS ACTUAL'!P34","v":"(à compléter) "},null,null,{"$f":"'BUDGET VS ACTUAL'!W34","v":0},0,{"$f":"'BUDGET VS ACTUAL'!AL34","v":0},{"$f":"IF('BUDGET VS ACTUAL'!AM34=0,'BUDGET VS ACTUAL'!AG34,'BUDGET VS ACTUAL'!AM34)","v":0},0]
[null,null,{"$f":"'BUDGET VS ACTUAL'!P35","v":"(à compléter) "},null,null,{"$f":"'BUDGET VS ACTUAL'!W35","v":0},0,{"$f":"'BUDGET VS ACTUAL'!AL35","v":0},{"$f":"IF('BUDGET VS ACTUAL'!AM35=0,'BUDGET VS ACTUAL'!AG35,'BUDGET VS ACTUAL'!AM35)","v":0},0]
[null,null,"Total",null,null,{"$f":"SUM(F32:F35)","v":0},0,{"$f":"SUM(H32:H35)","v":0},0,{"$f":"H36-F36","v":0}]
[null,null,"Frais de fonctionnement directs**"]
[null,null,{"$f":"'BUDGET VS ACTUAL'!P38","v":"Choisissez dans la liste Frais de fonctionnement directs"},{"$f":"'BUDGET VS ACTUAL'!Q38","v":" "},null,{"$f":"'BUDGET VS ACTUAL'!W38","v":0},0,{"$f":"'BUDGET VS ACTUAL'!AL38","v":0},{"$f":"IF('BUDGET VS ACTUAL'!AM38=0,'BUDGET VS ACTUAL'!AG38,'BUDGET VS ACTUAL'!AM38)","v":0},{"$f":"H38-F38","v":0}]
[null,null,{"$f":"'BUDGET VS ACTUAL'!P39","v":"Choisissez dans la liste Frais de fonctionnement directs"},{"$f":"'BUDGET VS ACTUAL'!Q39","v":" "},null,{"$f":"'BUDGET VS ACTUAL'!W39","v":0},0,{"$f":"'BUDGET VS ACTUAL'!AL39","v":0},{"$f":"IF('BUDGET VS ACTUAL'!AM39=0,'BUDGET VS ACTUAL'!AG39,'BUDGET VS ACTUAL'!AM39)","v":0},0]
[null,null,{"$f":"'BUDGET VS ACTUAL'!P40","v":"Choisissez dans la liste Frais de fonctionnement directs"},{"$f":"'BUDGET VS ACTUAL'!Q40","v":" "},null,{"$f":"'BUDGET VS ACTUAL'!W40","v":0},0,{"$f":"'BUDGET VS ACTUAL'!AL40","v":0},{"$f":"IF('BUDGET VS ACTUAL'!AM40=0,'BUDGET VS ACTUAL'!AG40,'BUDGET VS ACTUAL'!AM40)","v":0},0]
[null,null,{"$f":"'BUDGET VS ACTUAL'!P41","v":"Choisissez dans la liste Frais de fonctionnement directs"},{"$f":"'BUDGET VS ACTUAL'!Q41","v":" "},null,{"$f":"'BUDGET VS ACTUAL'!W41","v":0},0,{"$f":"'BUDGET VS ACTUAL'!AL41","v":0},{"$f":"IF('BUDGET VS ACTUAL'!AM41=0,'BUDGET VS ACTUAL'!AG41,'BUDGET VS ACTUAL'!AM41)","v":0},0]
[null,null,{"$f":"'BUDGET VS ACTUAL'!P42","v":"Choisissez dans la liste Frais de fonctionnement directs"},{"$f":"'BUDGET VS ACTUAL'!Q42","v":" "},null,{"$f":"'BUDGET VS ACTUAL'!W42","v":0},0,{"$f":"'BUDGET VS ACTUAL'!AL42","v":0},{"$f":"IF('BUDGET VS ACTUAL'!AM42=0,'BUDGET VS ACTUAL'!AG42,'BUDGET VS ACTUAL'!AM42)","v":0},0]
[null,null,{"$f":"'BUDGET VS ACTUAL'!P43","v":"Choisissez dans la liste Frais de fonctionnement directs"},{"$f":"'BUDGET VS ACTUAL'!Q43","v":" "},null,{"$f":"'BUDGET VS ACTUAL'!W43","v":0},0,{"$f":"'BUDGET VS ACTUAL'!AL43","v":0},{"$f":"IF('BUDGET VS ACTUAL'!AM43=0,'BUDGET VS ACTUAL'!AG43,'BUDGET VS ACTUAL'!AM43)","v":0},0]
[null,null,{"$f":"'BUDGET VS ACTUAL'!P44","v":"Choisissez dans la liste Frais de fonctionnement directs"},{"$f":"'BUDGET VS ACTUAL'!Q44","v":" "},null,{"$f":"'BUDGET VS ACTUAL'!W44","v":0},0,{"$f":"'BUDGET VS ACTUAL'!AL44","v":0},{"$f":"IF('BUDGET VS ACTUAL'!AM44=0,'BUDGET VS ACTUAL'!AG44,'BUDGET VS ACTUAL'!AM44)","v":0},0]
[null,null,{"$f":"'BUDGET VS ACTUAL'!P45","v":"Choisissez dans la liste Frais de fonctionnement directs"},{"$f":"'BUDGET VS ACTUAL'!Q45","v":" "},null,{"$f":"'BUDGET VS ACTUAL'!W45","v":0},0,{"$f":"'BUDGET VS ACTUAL'!AL45","v":0},{"$f":"IF('BUDGET VS ACTUAL'!AM45=0,'BUDGET VS ACTUAL'!AG45,'BUDGET VS ACTUAL'!AM45)","v":0},0]
[null,null,{"$f":"'BUDGET VS ACTUAL'!P46","v":"Choisissez dans la liste Frais de fonctionnement directs"},{"$f":"'BUDGET VS ACTUAL'!Q46","v":" "},null,{"$f":"'BUDGET VS ACTUAL'!W46","v":0},0,{"$f":"'BUDGET VS ACTUAL'!AL46","v":0},{"$f":"IF('BUDGET VS ACTUAL'!AM46=0,'BUDGET VS ACTUAL'!AG46,'BUDGET VS ACTUAL'!AM46)","v":0},0]
[null,null,{"$f":"'BUDGET VS ACTUAL'!P47","v":"Autre : (compléter soi-même)"},{"$f":"'BUDGET VS ACTUAL'!Q47","v":" "},null,{"$f":"'BUDGET VS ACTUAL'!W47","v":0},0,{"$f":"'BUDGET VS ACTUAL'!AL47","v":0},{"$f":"IF('BUDGET VS ACTUAL'!AM47=0,'BUDGET VS ACTUAL'!AG47,'BUDGET VS ACTUAL'!AM47)","v":0},0]
[null,null,{"$f":"'BUDGET VS ACTUAL'!P48","v":"Autre : (compléter soi-même)"},{"$f":"'BUDGET VS ACTUAL'!Q48","v":" "},null,{"$f":"'BUDGET VS ACTUAL'!W48","v":0},0,{"$f":"'BUDGET VS ACTUAL'!AL48","v":0},{"$f":"IF('BUDGET VS ACTUAL'!AM48=0,'BUDGET VS ACTUAL'!AG48,'BUDGET VS ACTUAL'!AM48)","v":0},0]
[null,null,"Total",null,null,{"$f":"SUM(F38:F48)","v":0},{"$f":"IF(E49=0,0,F49/E49)","v":0},{"$f":"SUM(H38:H48)","v":0},{"$f":"IF(G49=0,0,H49/G49)","v":0},{"$f":"H49-F49","v":0}]
[null,null,"Frais de fonctionnement indirects"]
[null,null,{"$f":"'BUDGET VS ACTUAL'!P51","v":"Choisissez dans la liste Frais de fonctionnement indirects"},null,null,{"$f":"'BUDGET VS ACTUAL'!W51","v":0},0,{"$f":"'BUDGET VS ACTUAL'!AL51","v":0},{"$f":"IF('BUDGET VS ACTUAL'!AM51=0,'BUDGET VS ACTUAL'!AG51,'BUDGET VS ACTUAL'!AM51)","v":0},{"$f":"H51-F51","v":0}]
[null,null,{"$f":"'BUDGET VS ACTUAL'!P52","v":"Choisissez dans la liste Frais de fonctionnement indirects"},null,null,{"$f":"'BUDGET VS ACTUAL'!W52","v":0},0,{"$f":"'BUDGET VS ACTUAL'!AL52","v":0},{"$f":"IF('BUDGET VS ACTUAL'!AM52=0,'BUDGET VS ACTUAL'!AG52,'BUDGET VS ACTUAL'!AM52)","v":0},0]
[null,null,{"$f":"'BUDGET VS ACTUAL'!P53","v":"Choisissez dans la liste Frais de fonctionnement indirects"},null,null,{"$f":"'BUDGET VS ACTUAL'!W53","v":0},0,{"$f":"'BUDGET VS ACTUAL'!AL53","v":0},{"$f":"IF('BUDGET VS ACTUAL'!AM53=0,'BUDGET VS ACTUAL'!AG53,'BUDGET VS ACTUAL'!AM53)","v":0},0]
[null,null,{"$f":"'BUDGET VS ACTUAL'!P54","v":"Choisissez dans la liste Frais de fonctionnement indirects"},null,null,{"$f":"'BUDGET VS ACTUAL'!W54","v":0},0,{"$f":"'BUDGET VS ACTUAL'!AL54","v":0},{"$f":"IF('BUDGET VS ACTUAL'!AM54=0,'BUDGET VS ACTUAL'!AG54,'BUDGET VS ACTUAL'!AM54)","v":0},0]
[null,null,{"$f":"'BUDGET VS ACTUAL'!P55","v":"Choisissez dans la liste Frais de fonctionnement indirects"},null,null,{"$f":"'BUDGET VS ACTUAL'!W55","v":0},0,{"$f":"'BUDGET VS ACTUAL'!AL55","v":0},{"$f":"IF('BUDGET VS ACTUAL'!AM55=0,'BUDGET VS ACTUAL'!AG55,'BUDGET VS ACTUAL'!AM55)","v":0},0]
[null,null,{"$f":"'BUDGET VS ACTUAL'!P56","v":"Choisissez dans la liste Frais de fonctionnement indirects"},null,null,{"$f":"'BUDGET VS ACTUAL'!W56","v":0},0,{"$f":"'BUDGET VS ACTUAL'!AL56","v":0},{"$f":"IF('BUDGET VS ACTUAL'!AM56=0,'BUDGET VS ACTUAL'!AG56,'BUDGET VS ACTUAL'!AM56)","v":0},0]
[null,null,{"$f":"'BUDGET VS ACTUAL'!P57","v":"Choisissez dans la liste Frais de fonctionnement indirects"},null,null,{"$f":"'BUDGET VS ACTUAL'!W57","v":0},0,{"$f":"'BUDGET VS ACTUAL'!AL57","v":0},{"$f":"IF('BUDGET VS ACTUAL'!AM57=0,'BUDGET VS ACTUAL'!AG57,'BUDGET VS ACTUAL'!AM57)","v":0},0]
[null,null,{"$f":"'BUDGET VS ACTUAL'!P58","v":"Choisissez dans la liste Frais de fonctionnement indirects"},null,null,{"$f":"'BUDGET VS ACTUAL'!W58","v":0},0,{"$f":"'BUDGET VS ACTUAL'!AL58","v":0},{"$f":"IF('BUDGET VS ACTUAL'!AM58=0,'BUDGET VS ACTUAL'!AG58,'BUDGET VS ACTUAL'!AM58)","v":0},0]
[null,null,{"$f":"'BUDGET VS ACTUAL'!P59","v":"Choisissez dans la liste Frais de fonctionnement indirects"},null,null,{"$f":"'BUDGET VS ACTUAL'!W59","v":0},0,{"$f":"'BUDGET VS ACTUAL'!AL59","v":0},{"$f":"IF('BUDGET VS ACTUAL'!AM59=0,'BUDGET VS ACTUAL'!AG59,'BUDGET VS ACTUAL'!AM59)","v":0},0]
[null,null,{"$f":"'BUDGET VS ACTUAL'!P60","v":"Choisissez dans la liste Frais de fonctionnement indirects"},null,null,{"$f":"'BUDGET VS ACTUAL'!W60","v":0},0,{"$f":"'BUDGET VS ACTUAL'!AL60","v":0},{"$f":"IF('BUDGET VS ACTUAL'!AM60=0,'BUDGET VS ACTUAL'!AG60,'BUDGET VS ACTUAL'!AM60)","v":0},0]
[null,null,{"$f":"'BUDGET VS ACTUAL'!P61","v":"Autre : (compléter soi-même)"},null,null,{"$f":"'BUDGET VS ACTUAL'!W61","v":0},{"$f":"IF(E61=0,0,F61/E61)","v":0},{"$f":"'BUDGET VS ACTUAL'!AL61","v":0},{"$f":"IF('BUDGET VS ACTUAL'!AM61=0,'BUDGET VS ACTUAL'!AG61,'BUDGET VS ACTUAL'!AM61)","v":0},{"$f":"H61-F61","v":0}]
[null,null,{"$f":"'BUDGET VS ACTUAL'!P62","v":"Autre : (compléter soi-même)"},null,null,{"$f":"'BUDGET VS ACTUAL'!W62","v":0},0,{"$f":"'BUDGET VS ACTUAL'!AL61","v":0},{"$f":"IF('BUDGET VS ACTUAL'!AM62=0,'BUDGET VS ACTUAL'!AG62,'BUDGET VS ACTUAL'!AM62)","v":0},0]
[null,null,"Total",null,null,{"$f":"SUM(F51:F62)","v":0},{"$f":"IF(E63=0,0,F63/E63)","v":0},{"$f":"SUM(H51:H62)","v":0},{"$f":"IF(G63=0,0,H63/G63)","v":0},{"$f":"H63-F63","v":0}]
[null,null,"TOTAL",null,null,{"$f":"F24+F30+F36+F49+F63","v":0},{"$f":"IF(E64=0,0,F64/E64)","v":0},{"$f":"H24+H30+H36+H49+H63","v":0},{"$f":"IF(G64=0,0,H64/G64)","v":0},{"$f":"H64-F64","v":0}]
[]
[null,null,null,null,null,"DIFFERENCE ENTRE BUDGET ET FINANCEMENT"]

{"sheet":"BUDGET VS ACTUAL","index":18,"n_rows":81,"n_cols":41,"rows_kept":81,"cut":false,"hidden":true,"merged":[[70,29,70,34],[71,29,71,30],[76,29,76,30],[75,29,75,30],[4,10,4,12],[5,10,5,12],[37,16,37,17],[38,16,38,17],[39,16,39,17],[40,16,40,17],[41,16,41,17],[42,16,42,17],[43,16,43,17],[44,16,44,17],[45,16,45,17],[46,16,46,17],[3,10,3,12],[3,23,3,26],[11,29,11,40],[8,3,8,12],[9,3,9,12],[11,3,11,12],[8,16,8,25],[9,16,9,25],[10,16,10,25],[11,16,11,25],[10,3,10,12],[63,4,63,8],[80,4,80,7],[12,16,12,25],[63,17,63,21],[80,17,80,20],[70,3,70,12],[70,16,70,25],[12,3,12,12],[47,16,47,17],[78,35,78,36],[78,29,78,30],[12,35,12,40],[70,35,70,40],[71,35,71,36],[72,35,72,36],[73,35,73,36],[74,35,74,36],[75,35,75,36],[76,35,76,36],[77,35,77,36],[72,29,72,30],[73,29,73,30],[74,29,74,30],[77,29,77,30],[12,29,12,34]]}
[]
[]
[]
[null,null,null,null,null,null,null,null,null,null,"BUDGET INI APPROUVE",null,null,null,null,null,null,null,null,null,null,null,null,"BUDGET AJU APPROUVE"]
[]
[]
[null,null,null,null,"Choisissez dans la liste Frais de fonctionnement indirects"]
[]
[null,null,"Bénéficiaire :",{"$f":"'BUDGET INI APPROUVE'!E9","v":0},null,null,null,null,null,null,null,null,null,null,null,"Bénéficiaire :",{"$f":"D9","v":0}]
[null,null,"Projet :",{"$f":"'BUDGET INI APPROUVE'!E10","v":0},null,null,null,null,null,null,null,null,null,null,null,"Projet :",{"$f":"D10","v":0}]
[null,null,"Personne de contact",{"$f":"'BUDGET INI APPROUVE'!E11","v":0},null,null,null,null,null,null,null,null,null,null,null,"Personne de contact",0]
[null,null,"Durée du projet (nombre de mois) :",{"$f":"'BUDGET INI APPROUVE'!E12","v":0},null,null,null,null,null,null,null,null,null,null,null,"Durée du projet (nombre de mois) :",0]
[null,null,null,"BUDGET INI*",null,null,null,null,null,null,null,null,null,null,null,null,"BUDGET AJU**",null,null,null,null,null,null,null,null,null,null,null,null,"DEPENSES INTERMEDIAIRES ",null,null,null,null,null,"DEPENSES REELS"]
[null,null,{"$f":"'BUDGET INI APPROUVE'!C16","v":"Budget 2021"},"ETP","Prix unitaire (par mois)","Prix unitaire (par année)","Nombre de mois du projet","% de temps au projet","Montant total du projet","Approuvé par Fedasil (projet ou activité)","% Fedasil","Autres sources de financement","% autres sources",null,null,{"$f":"'BUDGET AJU APPROUVE'!C13","v":"Budget 2021"},"ETP","Frais unitaire (par mois)","Frais unitaire (par an)","Nombre de mois du projet","%  de temps au projet","Montant total du projet","Approuvé par Fedasil (projet ou activité)","% Fedasil","Autres sources de financement","% autres sources",null,null,null,"Projet réalisé","% réalisé","Dépenses réelles Fedasil","% Fedasil réalisé","Autres sources de financement dépenses réelles","% autres sources","Projet réalisé","% réalisé","Fedasil dépenses réelles","% Fedasil réalisé","Autres sources de financement dépenses réelles","% autres sources"]
[null,null,"Personnel",null,null,null,null,null,null,null,null,null,null,null,null,"Personnel",null,null,null,null,null,null,null,null,null,null,null,null,null,"(étape1)",null,"(étape2)",null,null,null,"(étape1)",null,"(étape2)"]
[null,null,{"$f":"IF('BUDGET AJU APPROUVE'!C15=\"(nom à compléter)\",'BUDGET INI APPROUVE'!C18,'BUDGET AJU APPROUVE'!C15)","v":"(nom à compléter)"},{"$f":"IF('BUDGET AJU APPROUVE'!E15=0,'BUDGET INI APPROUVE'!E18,'BUDGET AJU APPROUVE'!E15)","v":0},{"$f":"IF('BUDGET AJU APPROUVE'!F15=0,'BUDGET INI APPROUVE'!F18,'BUDGET AJU APPROUVE'!F15)","v":0},{"$f":"+E16*12","v":0},{"$f":"IF('BUDGET AJU APPROUVE'!H15=0,'BUDGET INI APPROUVE'!H18,'BUDGET AJU APPROUVE'!H15)","v":0},{"$f":"IF('BUDGET AJU APPROUVE'!I15=0,'BUDGET INI APPROUVE'!I18,'BUDGET AJU APPROUVE'!I15)","v":0},{"$f":"H16*G16*E16","v":0},{"$f":"IF('BUDGET AJU APPROUVE'!K15=0,'BUDGET INI APPROUVE'!K18,'BUDGET AJU APPROUVE'!K15)","v":0},{"$f":"IF(I16=0,0,J16/I16)","v":0},{"$f":"I16-J16","v":0},{"$f":"IF(I16=0,0,L16/I16)","v":0},null,null,{"$f":"'BUDGET AJU APPROUVE'!C15","v":"(nom à compléter)"},{"$f":"'BUDGET AJU APPROUVE'!E15","v":0},{"$f":"'BUDGET AJU APPROUVE'!F15","v":0},{"$f":"'BUDGET AJU APPROUVE'!G15","v":0},{"$f":"'BUDGET AJU APPROUVE'!H15","v":0},{"$f":"'BUDGET AJU APPROUVE'!I15","v":0},{"$f":"U16*T16*R16","v":0},{"$f":"'BUDGET AJU APPROUVE'!K15","v":0},{"$f":"'BUDGET AJU APPROUVE'!L15","v":0},{"$f":"'BUDGET AJU APPROUVE'!M15","v":0},{"$f":"'BUDGET AJU APPROUVE'!N15","v":0},null,null,null,{"$f":"AF16+AH16","v":0},{"$f":"IF(I16=0,0,AD16/I16)","v":0},{"$f":"'Frais de personnel'!N20","v":0},{"$f":"IF(AD16=0,0,AF16/AD16)","v":0},{"$f":"'Frais de personnel'!L20-'Frais de personnel'!N20","v":0},{"$f":"IF(AD16=0,0,AH16/AD16)","v":0},{"$f":"AL16+AN16","v":0},{"$f":"IF(V16=0,0,AJ16/V16)","v":0},{"$f":"'Frais de personnel'!T20","v":0},{"$f":"IF(AJ16=0,0,AL16/AJ16)","v":0},{"$f":"'Frais de personnel'!L20-'Frais de personnel'!N20","v":0},{"$f":"IF(AJ16=0,0,AN16/AJ16)","v":0}]
[null,null,{"$f":"IF('BUDGET AJU APPROUVE'!C16=\"(nom à compléter)\",'BUDGET INI APPROUVE'!C19,'BUDGET AJU APPROUVE'!C16)","v":"(nom à compléter)"},{"$f":"IF('BUDGET AJU APPROUVE'!E16=0,'BUDGET INI APPROUVE'!E19,'BUDGET AJU APPROUVE'!E16)","v":0},{"$f":"IF('BUDGET AJU APPROUVE'!F16=0,'BUDGET INI APPROUVE'!F19,'BUDGET AJU APPROUVE'!F16)","v":0},{"$f":"+E17*12","v":0},{"$f":"IF('BUDGET AJU APPROUVE'!H16=0,'BUDGET INI APPROUVE'!H19,'BUDGET AJU APPROUVE'!H16)","v":0},{"$f":"IF('BUDGET AJU APPROUVE'!I16=0,'BUDGET INI APPROUVE'!I19,'BUDGET AJU APPROUVE'!I16)","v":0},{"$f":"H17*G17*E17","v":0},{"$f":"IF('BUDGET AJU APPROUVE'!K16=0,'BUDGET INI APPROUVE'!K19,'BUDGET AJU APPROUVE'!K16)","v":0},{"$f":"IF(I17=0,0,J17/I17)","v":0},{"$f":"I17-J17","v":0},{"$f":"IF(I17=0,0,L17/I17)","v":0},null,null,{"$f":"'BUDGET AJU APPROUVE'!C16","v":"(nom à compléter)"},{"$f":"'BUDGET AJU APPROUVE'!E16","v":0},{"$f":"'BUDGET AJU APPROUVE'!F16","v":0},{"$f":"'BUDGET AJU APPROUVE'!G16","v":0},{"$f":"'BUDGET AJU APPROUVE'!H16","v":0},{"$f":"'BUDGET AJU APPROUVE'!I16","v":0},{"$f":"U17*T17*R17","v":0},{"$f":"'BUDGET AJU APPROUVE'!K16","v":0},{"$f":"'BUDGET AJU APPROUVE'!L16","v":0},{"$f":"'BUDGET AJU APPROUVE'!M16","v":0},{"$f":"'BUDGET AJU APPROUVE'!N16","v":0},null,null,null,{"$f":"AF17+AH17","v":0},0,{"$f":"'Frais de personnel'!N36","v":0},{"$f":"IF(AD17=0,0,AF17/AD17)","v":0},{"$f":"'Frais de personnel'!L36-'Frais de personnel'!N36","v":0},{"$f":"IF(AD17=0,0,AH17/AD17)","v":0},{"$f":"AL17+AN17","v":0},{"$f":"IF(V17=0,0,AJ17/V17)","v":0},{"$f":"'Frais de personnel'!T36","v":0},{"$f":"IF(AJ17=0,0,AL17/AJ17)","v":0},{"$f":"'Frais de personnel'!L36-'Frais de personnel'!N36","v":0},{"$f":"IF(AJ17=0,0,AN17/AJ17)","v":0}]
[null,null,{"$f":"IF('BUDGET AJU APPROUVE'!C17=\"(nom à compléter)\",'BUDGET INI APPROUVE'!C20,'BUDGET AJU APPROUVE'!C17)","v":"(nom à compléter)"},{"$f":"IF('BUDGET AJU APPROUVE'!E17=0,'BUDGET INI APPROUVE'!E20,'BUDGET AJU APPROUVE'!E17)","v":0},{"$f":"IF('BUDGET AJU APPROUVE'!F17=0,'BUDGET INI APPROUVE'!F20,'BUDGET AJU APPROUVE'!F17)","v":0},0,{"$f":"IF('BUDGET AJU APPROUVE'!H17=0,'BUDGET INI APPROUVE'!H20,'BUDGET AJU APPROUVE'!H17)","v":0},{"$f":"IF('BUDGET AJU APPROUVE'!I17=0,'BUDGET INI APPROUVE'!I20,'BUDGET AJU APPROUVE'!I17)","v":0},0,{"$f":"IF('BUDGET AJU APPROUVE'!K17=0,'BUDGET INI APPROUVE'!K20,'BUDGET AJU APPROUVE'!K17)","v":0},{"$f":"IF(I18=0,0,J18/I18)","v":0},0,{"$f":"IF(I18=0,0,L18/I18)","v":0},null,null,{"$f":"'BUDGET AJU APPROUVE'!C17","v":"(nom à compléter)"},{"$f":"'BUDGET AJU APPROUVE'!E17","v":0},{"$f":"'BUDGET AJU APPROUVE'!F17","v":0},{"$f":"'BUDGET AJU APPROUVE'!G17","v":0},{"$f":"'BUDGET AJU APPROUVE'!H17","v":0},{"$f":"'BUDGET AJU APPROUVE'!I17","v":0},0,{"$f":"'BUDGET AJU APPROUVE'!K17","v":0},{"$f":"'BUDGET AJU APPROUVE'!L17","v":0},{"$f":"'BUDGET AJU APPROUVE'!M17","v":0},{"$f":"'BUDGET AJU APPROUVE'!N17","v":0},null,null,null,0,0,{"$f":"'Frais de personnel'!N52","v":0},0,{"$f":"'Frais de personnel'!L52-'Frais de personnel'!N52","v":0},0,{"$f":"AL18+AN18","v":0},0,{"$f":"'Frais de personnel'!T52","v":0},0,{"$f":"'Frais de personnel'!L52-'Frais de personnel'!N52","v":0},0]
[null,null,{"$f":"IF('BUDGET AJU APPROUVE'!C18=\"(nom à compléter)\",'BUDGET INI APPROUVE'!C21,'BUDGET AJU APPROUVE'!C18)","v":"(nom à compléter)"},{"$f":"IF('BUDGET AJU APPROUVE'!E18=0,'BUDGET INI APPROUVE'!E21,'BUDGET AJU APPROUVE'!E18)","v":0},{"$f":"IF('BUDGET AJU APPROUVE'!F18=0,'BUDGET INI APPROUVE'!F21,'BUDGET AJU APPROUVE'!F18)","v":0},0,{"$f":"IF('BUDGET AJU APPROUVE'!H18=0,'BUDGET INI APPROUVE'!H21,'BUDGET AJU APPROUVE'!H18)","v":0},{"$f":"IF('BUDGET AJU APPROUVE'!I18=0,'BUDGET INI APPROUVE'!I21,'BUDGET AJU APPROUVE'!I18)","v":0},0,{"$f":"IF('BUDGET AJU APPROUVE'!K18=0,'BUDGET INI APPROUVE'!K21,'BUDGET AJU APPROUVE'!K18)","v":0},0,0,0,null,null,{"$f":"'BUDGET AJU APPROUVE'!C18","v":"(nom à compléter)"},{"$f":"'BUDGET AJU APPROUVE'!E18","v":0},{"$f":"'BUDGET AJU APPROUVE'!F18","v":0},{"$f":"'BUDGET AJU APPROUVE'!G18","v":0},{"$f":"'BUDGET AJU APPROUVE'!H18","v":0},{"$f":"'BUDGET AJU APPROUVE'!I18","v":0},0,{"$f":"'BUDGET AJU APPROUVE'!K18","v":0},{"$f":"'BUDGET AJU APPROUVE'!L18","v":0},{"$f":"'BUDGET AJU APPROUVE'!M18","v":0},{"$f":"'BUDGET AJU APPROUVE'!N18","v":0},null,null,null,0,0,{"$f":"'Frais de personnel'!N68","v":0},0,{"$f":"'Frais de personnel'!L68-'Frais de personnel'!N68","v":0},0,0,0,{"$f":"'Frais de personnel'!N68","v":0},0,{"$f":"'Frais de personnel'!L68-'Frais de personnel'!N68","v":0},0]
[null,null,{"$f":"IF('BUDGET AJU APPROUVE'!C19=\"(nom à compléter)\",'BUDGET INI APPROUVE'!C22,'BUDGET AJU APPROUVE'!C19)","v":"(nom à compléter)"},{"$f":"IF('BUDGET AJU APPROUVE'!E19=0,'BUDGET INI APPROUVE'!E22,'BUDGET AJU APPROUVE'!E19)","v":0},{"$f":"IF('BUDGET AJU APPROUVE'!F19=0,'BUDGET INI APPROUVE'!F22,'BUDGET AJU APPROUVE'!F19)","v":0},0,{"$f":"IF('BUDGET AJU APPROUVE'!H19=0,'BUDGET INI APPROUVE'!H22,'BUDGET AJU APPROUVE'!H19)","v":0},{"$f":"IF('BUDGET AJU APPROUVE'!I19=0,'BUDGET INI APPROUVE'!I22,'BUDGET AJU APPROUVE'!I19)","v":0},0,{"$f":"IF('BUDGET AJU APPROUVE'!K19=0,'BUDGET INI APPROUVE'!K22,'BUDGET AJU APPROUVE'!K19)","v":0},0,0,0,null,null,{"$f":"'BUDGET AJU APPROUVE'!C19","v":"(nom à compléter)"},{"$f":"'BUDGET AJU APPROUVE'!E19","v":0},{"$f":"'BUDGET AJU APPROUVE'!F19","v":0},{"$f":"'BUDGET AJU APPROUVE'!G19","v":0},{"$f":"'BUDGET AJU APPROUVE'!H19","v":0},{"$f":"'BUDGET AJU APPROUVE'!I19","v":0},0,{"$f":"'BUDGET AJU APPROUVE'!K19","v":0},{"$f":"'BUDGET AJU APPROUVE'!L19","v":0},{"$f":"'BUDGET AJU APPROUVE'!M19","v":0},{"$f":"'BUDGET AJU APPROUVE'!N19","v":0},null,null,null,0,0,{"$f":"'Frais de personnel'!N84","v":0},0,{"$f":"'Frais de personnel'!L84-'Frais de personnel'!N84","v":0},0,0,0,{"$f":"'Frais de personnel'!N84","v":0},0,{"$f":"'Frais de personnel'!L84-'Frais de personnel'!N84","v":0},0]
[null,null,{"$f":"IF('BUDGET AJU APPROUVE'!C20=\"(nom à compléter)\",'BUDGET INI APPROUVE'!C23,'BUDGET AJU APPROUVE'!C20)","v":"(nom à compléter)"},{"$f":"IF('BUDGET AJU APPROUVE'!E20=0,'BUDGET INI APPROUVE'!E23,'BUDGET AJU APPROUVE'!E20)","v":0},{"$f":"IF('BUDGET AJU APPROUVE'!F20=0,'BUDGET INI APPROUVE'!F23,'BUDGET AJU APPROUVE'!F20)","v":0},0,{"$f":"IF('BUDGET AJU APPROUVE'!H20=0,'BUDGET INI APPROUVE'!H23,'BUDGET AJU APPROUVE'!H20)","v":0},{"$f":"IF('BUDGET AJU APPROUVE'!I20=0,'BUDGET INI APPROUVE'!I23,'BUDGET AJU APPROUVE'!I20)","v":0},0,{"$f":"IF('BUDGET AJU APPROUVE'!K20=0,'BUDGET INI APPROUVE'!K23,'BUDGET AJU APPROUVE'!K20)","v":0},0,0,0,null,null,{"$f":"'BUDGET AJU APPROUVE'!C20","v":"(nom à compléter)"},{"$f":"'BUDGET AJU APPROUVE'!E20","v":0},{"$f":"'BUDGET AJU APPROUVE'!F20","v":0},{"$f":"'BUDGET AJU APPROUVE'!G20","v":0},{"$f":"'BUDGET AJU APPROUVE'!H20","v":0},{"$f":"'BUDGET AJU APPROUVE'!I20","v":0},0,{"$f":"'BUDGET AJU APPROUVE'!K20","v":0},{"$f":"'BUDGET AJU APPROUVE'!L20","v":0},{"$f":"'BUDGET AJU APPROUVE'!M20","v":0},{"$f":"'BUDGET AJU APPROUVE'!N20","v":0},null,null,null,0,0,{"$f":"'Frais de personnel'!N100","v":0},0,{"$f":"'Frais de personnel'!L100-'Frais de personnel'!N100","v":0},0,0,0,{"$f":"'Frais de personnel'!N100","v":0},0,{"$f":"'Frais de personnel'!L100-'Frais de personnel'!N100","v":0},0]
[null,null,{"$f":"IF('BUDGET AJU APPROUVE'!C21=\"(nom à compléter)\",'BUDGET INI APPROUVE'!C24,'BUDGET AJU APPROUVE'!C21)","v":"(nom à compléter)"},{"$f":"IF('BUDGET AJU APPROUVE'!E21=0,'BUDGET INI APPROUVE'!E24,'BUDGET AJU APPROUVE'!E21)","v":0},{"$f":"IF('BUDGET AJU APPROUVE'!F21=0,'BUDGET INI APPROUVE'!F24,'BUDGET AJU APPROUVE'!F21)","v":0},0,{"$f":"IF('BUDGET AJU APPROUVE'!H21=0,'BUDGET INI APPROUVE'!H24,'BUDGET AJU APPROUVE'!H21)","v":0},{"$f":"IF('BUDGET AJU APPROUVE'!I21=0,'BUDGET INI APPROUVE'!I24,'BUDGET AJU APPROUVE'!I21)","v":0},0,{"$f":"IF('BUDGET AJU APPROUVE'!K21=0,'BUDGET INI APPROUVE'!K24,'BUDGET AJU APPROUVE'!K21)","v":0},0,0,0,null,null,{"$f":"'BUDGET AJU APPROUVE'!C21","v":"(nom à compléter)"},{"$f":"'BUDGET AJU APPROUVE'!E21","v":0},{"$f":"'BUDGET AJU APPROUVE'!F21","v":0},{"$f":"'BUDGET AJU APPROUVE'!G21","v":0},{"$f":"'BUDGET AJU APPROUVE'!H21","v":0},{"$f":"'BUDGET AJU APPROUVE'!I21","v":0},0,{"$f":"'BUDGET AJU APPROUVE'!K21","v":0},{"$f":"'BUDGET AJU APPROUVE'!L21","v":0},{"$f":"'BUDGET AJU APPROUVE'!M21","v":0},{"$f":"'BUDGET AJU APPROUVE'!N21","v":0},null,null,null,0,0,{"$f":"'Frais de personnel'!N116","v":0},0,{"$f":"'Frais de personnel'!L116-'Frais de personnel'!N116","v":0},0,0,0,{"$f":"'Frais de personnel'!N116","v":0},0,{"$f":"'Frais de personnel'!L116-'Frais de personnel'!N116","v":0},0]
[null,null,{"$f":"IF('BUDGET AJU APPROUVE'!C22=\"(nom à compléter)\",'BUDGET INI APPROUVE'!C25,'BUDGET AJU APPROUVE'!C22)","v":"(nom à compléter)"},{"$f":"IF('BUDGET AJU APPROUVE'!E22=0,'BUDGET INI APPROUVE'!E25,'BUDGET AJU APPROUVE'!E22)","v":0},{"$f":"IF('BUDGET AJU APPROUVE'!F22=0,'BUDGET INI APPROUVE'!F25,'BUDGET AJU APPROUVE'!F22)","v":0},0,{"$f":"IF('BUDGET AJU APPROUVE'!H22=0,'BUDGET INI APPROUVE'!H25,'BUDGET AJU APPROUVE'!H22)","v":0},{"$f":"IF('BUDGET AJU APPROUVE'!I22=0,'BUDGET INI APPROUVE'!I25,'BUDGET AJU APPROUVE'!I22)","v":0},0,{"$f":"IF('BUDGET AJU APPROUVE'!K22=0,'BUDGET INI APPROUVE'!K25,'BUDGET AJU APPROUVE'!K22)","v":0},0,0,0,null,null,{"$f":"'BUDGET AJU APPROUVE'!C22","v":"(nom à compléter)"},{"$f":"'BUDGET AJU APPROUVE'!E22","v":0},{"$f":"'BUDGET AJU APPROUVE'!F22","v":0},{"$f":"'BUDGET AJU APPROUVE'!G22","v":0},{"$f":"'BUDGET AJU APPROUVE'!H22","v":0},{"$f":"'BUDGET AJU APPROUVE'!I22","v":0},0,{"$f":"'BUDGET AJU APPROUVE'!K22","v":0},{"$f":"'BUDGET AJU APPROUVE'!L22","v":0},{"$f":"'BUDGET AJU APPROUVE'!M22","v":0},{"$f":"'BUDGET AJU APPROUVE'!N22","v":0},null,null,null,0,0,{"$f":"'Frais de personnel'!N132","v":0},0,{"$f":"'Frais de personnel'!L132-'Frais de personnel'!N132","v":0},0,0,0,{"$f":"'Frais de personnel'!N132","v":0},0,{"$f":"'Frais de personnel'!L132-'Frais de personnel'!N132","v":0},0]
[null,null,"Total",{"$f":"SUM(D16:D23)","v":0},null,{"$f":"SUM(F16:F23)","v":0},null,null,{"$f":"SUM(I16:I23)","v":0},{"$f":"SUM(J16:J23)","v":0},{"$f":"IF(I24=0,0,J24/I24)","v":0},{"$f":"SUM(L16:L23)","v":0},{"$f":"IF(I24=0,0,L24/I24)","v":0},null,null,"Total",{"$f":"SUM(Q16:Q23)","v":0},null,{"$f":"SUM(S16:S23)","v":0},null,null,{"$f":"SUM(V16:V23)","v":0},{"$f":"SUM(W16:W23)","v":0},{"$f":"IF(V24=0,0,W24/V24)","v":0},{"$f":"SUM(Y16:Y23)","v":0},{"$f":"IF(V24=0,0,Y24/V24)","v":0},null,null,null,{"$f":"SUM(AD16:AD23)","v":0},0,{"$f":"SUM(AF16:AF23)","v":0},{"$f":"IF(AD24=0,0,AF24/AD24)","v":0},{"$f":"SUM(AH16:AH23)","v":0},{"$f":"IF(AD24=0,0,AH24/AD24)","v":0},{"$f":"SUM(AJ16:AJ23)","v":0},{"$f":"IF(I24=0,0,AJ24/I24)","v":0},{"$f":"SUM(AL16:AL23)","v":0},{"$f":"IF(AJ24=0,0,AL24/AJ24)","v":0},{"$f":"SUM(AN16:AN23)","v":0},{"$f":"IF(AJ24=0,0,AN24/AJ24)","v":0}]
[null,null,"Location",null,null,null,null,null,null,null,null,null,null,null,null,"Location"]
[null,null,{"$f":"IF('BUDGET AJU APPROUVE'!C25=\"(Objet/Bâtiment & Adresse à compléter)\",'BUDGET INI APPROUVE'!C28,'BUDGET AJU APPROUVE'!C25)","v":"(Objet/Bâtiment & Adresse à compléter)"},null,{"$f":"IF('BUDGET AJU APPROUVE'!F25=0,'BUDGET INI APPROUVE'!F28,'BUDGET AJU APPROUVE'!F25)","v":0},{"$f":"+E26*12","v":0},{"$f":"IF('BUDGET AJU APPROUVE'!H25=0,'BUDGET INI APPROUVE'!H28,'BUDGET AJU APPROUVE'!H25)","v":0},{"$f":"IF('BUDGET AJU APPROUVE'!I25=0,'BUDGET INI APPROUVE'!I28,'BUDGET AJU APPROUVE'!I25)","v":0},{"$f":"H26*G26*E26","v":0},{"$f":"IF('BUDGET AJU APPROUVE'!K25=0,'BUDGET INI APPROUVE'!K28,'BUDGET AJU APPROUVE'!K25)","v":0},0,{"$f":"I26-J26","v":0},0,null,null,{"$f":"'BUDGET AJU APPROUVE'!C25","v":"(Objet/Bâtiment & Adresse à compléter)"},null,{"$f":"'BUDGET AJU APPROUVE'!F25","v":0},{"$f":"'BUDGET AJU APPROUVE'!G25","v":0},{"$f":"'BUDGET AJU APPROUVE'!H25","v":0},{"$f":"'BUDGET AJU APPROUVE'!I25","v":0},{"$f":"U26*T26*R26","v":0},{"$f":"'BUDGET AJU APPROUVE'!K25","v":0},{"$f":"'BUDGET AJU APPROUVE'!L25","v":0},{"$f":"'BUDGET AJU APPROUVE'!M25","v":0},{"$f":"'BUDGET AJU APPROUVE'!N25","v":0},null,null,null,{"$f":"AF26+AH26","v":0},{"$f":"IF(I26=0,0,AD26/I26)","v":0},{"$f":"Location!H18","v":0},{"$f":"IF(AD26=0,0,AF26/AD26)","v":0},{"$f":"Location!J18","v":0},{"$f":"IF(AD26=0,0,AH26/AD26)","v":0},{"$f":"AL26+AN26","v":0},{"$f":"IF(V26=0,0,AJ26/V26)","v":0},{"$f":"Location!H18","v":0},{"$f":"IF(AJ26=0,0,AL26/AJ26)","v":0},{"$f":"Location!J18","v":0},{"$f":"IF(AJ26=0,0,AN26/AJ26)","v":0}]
[null,null,{"$f":"IF('BUDGET AJU APPROUVE'!C26=\"(Objet/Bâtiment & Adresse à compléter)\",'BUDGET INI APPROUVE'!C29,'BUDGET AJU APPROUVE'!C26)","v":"(Objet/Bâtiment & Adresse à compléter)"},null,{"$f":"IF('BUDGET AJU APPROUVE'!F26=0,'BUDGET INI APPROUVE'!F29,'BUDGET AJU APPROUVE'!F26)","v":0},{"$f":"+E27*12","v":0},{"$f":"IF('BUDGET AJU APPROUVE'!H26=0,'BUDGET INI APPROUVE'!H29,'BUDGET AJU APPROUVE'!H26)","v":0},{"$f":"IF('BUDGET AJU APPROUVE'!I26=0,'BUDGET INI APPROUVE'!I29,'BUDGET AJU APPROUVE'!I26)","v":0},{"$f":"H27*G27*E27","v":0},{"$f":"IF('BUDGET AJU APPROUVE'!K26=0,'BUDGET INI APPROUVE'!K29,'BUDGET AJU APPROUVE'!K26)","v":0},0,{"$f":"I27-J27","v":0},{"$f":"IF(I27=0,0,L27/I27)","v":0},null,null,{"$f":"'BUDGET AJU APPROUVE'!C26","v":"(Objet/Bâtiment & Adresse à compléter)"},null,{"$f":"'BUDGET AJU APPROUVE'!F26","v":0},{"$f":"'BUDGET AJU APPROUVE'!G26","v":0},{"$f":"'BUDGET AJU APPROUVE'!H26","v":0},{"$f":"'BUDGET AJU APPROUVE'!I26","v":0},{"$f":"U27*T27*R27","v":0},{"$f":"'BUDGET AJU APPROUVE'!K26","v":0},{"$f":"'BUDGET AJU APPROUVE'!L26","v":0},{"$f":"'BUDGET AJU APPROUVE'!M26","v":0},{"$f":"'BUDGET AJU APPROUVE'!N26","v":0},null,null,null,{"$f":"AF27+AH27","v":0},{"$f":"IF(I27=0,0,AD27/I27)","v":0},{"$f":"Location!H31","v":0},0,{"$f":"Location!J31","v":0},{"$f":"IF(AD27=0,0,AH27/AD27)","v":0},{"$f":"AL27+AN27","v":0},{"$f":"IF(V27=0,0,AJ27/V27)","v":0},{"$f":"Location!H31","v":0},{"$f":"IF(AJ27=0,0,AL27/AJ27)","v":0},{"$f":"Location!J31","v":0},{"$f":"IF(AJ27=0,0,AN27/AJ27)","v":0}]
[null,null,{"$f":"IF('BUDGET AJU APPROUVE'!C27=\"(Objet/Bâtiment & Adresse à compléter)\",'BUDGET INI APPROUVE'!C30,'BUDGET AJU APPROUVE'!C27)","v":"(Objet/Bâtiment & Adresse à compléter)"},null,{"$f":"IF('BUDGET AJU APPROUVE'!F27=0,'BUDGET INI APPROUVE'!F30,'BUDGET AJU APPROUVE'!F27)","v":0},0,{"$f":"IF('BUDGET AJU APPROUVE'!H27=0,'BUDGET INI APPROUVE'!H30,'BUDGET AJU APPROUVE'!H27)","v":0},{"$f":"IF('BUDGET AJU APPROUVE'!I27=0,'BUDGET INI APPROUVE'!I30,'BUDGET AJU APPROUVE'!I27)","v":0},0,{"$f":"IF('BUDGET AJU APPROUVE'!K27=0,'BUDGET INI APPROUVE'!K30,'BUDGET AJU APPROUVE'!K27)","v":0},0,0,0,null,null,{"$f":"'BUDGET AJU APPROUVE'!C27","v":"(Objet/Bâtiment & Adresse à compléter)"},null,{"$f":"'BUDGET AJU APPROUVE'!F27","v":0},{"$f":"'BUDGET AJU APPROUVE'!G27","v":0},{"$f":"'BUDGET AJU APPROUVE'!H27","v":0},{"$f":"'BUDGET AJU APPROUVE'!I27","v":0},0,{"$f":"'BUDGET AJU APPROUVE'!K27","v":0},{"$f":"'BUDGET AJU APPROUVE'!L27","v":0},{"$f":"'BUDGET AJU APPROUVE'!M27","v":0},{"$f":"'BUDGET AJU APPROUVE'!N27","v":0},null,null,null,0,0,{"$f":"Location!H44","v":0},0,{"$f":"Location!J44","v":0},0,0,0,{"$f":"Location!H44","v":0},0,{"$f":"Location!J44","v":0},0]
[null,null,{"$f":"IF('BUDGET AJU APPROUVE'!C28=\"(Objet/Bâtiment & Adresse à compléter)\",'BUDGET INI APPROUVE'!C31,'BUDGET AJU APPROUVE'!C28)","v":"(Objet/Bâtiment & Adresse à compléter)"},null,{"$f":"IF('BUDGET AJU APPROUVE'!F28=0,'BUDGET INI APPROUVE'!F31,'BUDGET AJU APPROUVE'!F28)","v":0},0,{"$f":"IF('BUDGET AJU APPROUVE'!H28=0,'BUDGET INI APPROUVE'!H31,'BUDGET AJU APPROUVE'!H28)","v":0},{"$f":"IF('BUDGET AJU APPROUVE'!I28=0,'BUDGET INI APPROUVE'!I31,'BUDGET AJU APPROUVE'!I28)","v":0},{"$f":"H29*G29*E29","v":0},{"$f":"IF('BUDGET AJU APPROUVE'!K28=0,'BUDGET INI APPROUVE'!K31,'BUDGET AJU APPROUVE'!K28)","v":0},0,{"$f":"I29-J29","v":0},0,null,null,{"$f":"'BUDGET AJU APPROUVE'!C28","v":"(Objet/Bâtiment & Adresse à compléter)"},null,{"$f":"'BUDGET AJU APPROUVE'!F28","v":0},{"$f":"'BUDGET AJU APPROUVE'!G28","v":0},{"$f":"'BUDGET AJU APPROUVE'!H28","v":0},{"$f":"'BUDGET AJU APPROUVE'!I28","v":0},0,{"$f":"'BUDGET AJU APPROUVE'!K28","v":0},{"$f":"'BUDGET AJU APPROUVE'!L28","v":0},{"$f":"'BUDGET AJU APPROUVE'!M28","v":0},{"$f":"'BUDGET AJU APPROUVE'!N28","v":0},null,null,null,{"$f":"AF29+AH29","v":0},{"$f":"IF(I29=0,0,AD29/I29)","v":0},{"$f":"Location!H57","v":0},0,{"$f":"Location!J57","v":0},{"$f":"IF(AD29=0,0,AH29/AD29)","v":0},{"$f":"AL29+AN29","v":0},0,{"$f":"Location!H57","v":0},0,{"$f":"Location!J57","v":0},{"$f":"IF(AJ29=0,0,AN29/AJ29)","v":0}]
[null,null,"Total",null,null,{"$f":"SUM(F26:F29)","v":0},null,null,{"$f":"SUM(I26:I29)","v":0},{"$f":"SUM(J26)","v":0},{"$f":"IF(I30=0,0,J30/I30)","v":0},{"$f":"SUM(L26:L29)","v":0},{"$f":"IF(I30=0,0,L30/I30)","v":0},null,null,"Total",null,null,{"$f":"SUM(S26:S29)","v":0},null,null,{"$f":"SUM(V26:V29)","v":0},{"$f":"SUM(W26:W29)","v":0},{"$f":"IF(V30=0,0,W30/V30)","v":0},{"$f":"SUM(Y26:Y29)","v":0},{"$f":"IF(V30=0,0,Y30/V30)","v":0},null,null,null,{"$f":"SUM(AD26:AD29)","v":0},{"$f":"IF(I30=0,0,AD30/I30)","v":0},{"$f":"SUM(AF26:AF29)","v":0},{"$f":"IF(AD30=0,0,AF30/AD30)","v":0},{"$f":"SUM(AH26:AH29)","v":0},{"$f":"IF(AD30=0,0,AH30/AD30)","v":0},{"$f":"SUM(AJ26:AJ29)","v":0},{"$f":"IF(I30=0,0,AJ30/I30)","v":0},{"$f":"SUM(AL26:AL29)","v":0},{"$f":"IF(AJ30=0,0,AL30/AJ30)","v":0},{"$f":"SUM(AN26:AN29)","v":0},{"$f":"IF(AJ30=0,0,AN30/AJ30)","v":0}]
[null,null,"Investissements (par ex. hardware et/ou software) ",null,null,null,null,null,null,null,null,null,null,null,null,"Investissements (par ex. hardware/software) "]
[null,null,{"$f":"IF('BUDGET AJU APPROUVE'!C31=\"(Compléter la description) \",'BUDGET INI APPROUVE'!C34,'BUDGET AJU APPROUVE'!C31)","v":"(Compléter la description) "},null,null,{"$f":"IF('BUDGET AJU APPROUVE'!G31=0,'BUDGET INI APPROUVE'!G34,'BUDGET AJU APPROUVE'!G31)","v":0},null,{"$f":"IF('BUDGET AJU APPROUVE'!I31=0,'BUDGET INI APPROUVE'!I34,'BUDGET AJU APPROUVE'!I31)","v":0},{"$f":"F32*H32","v":0},{"$f":"IF('BUDGET AJU APPROUVE'!#REF!=0,'BUDGET INI APPROUVE'!K34,'BUDGET AJU APPROUVE'!#REF!)","v":{"$error":"#REF!"}},0,{"$f":"I32-J32","v":{"$error":"#REF!"}},0,null,null,{"$f":"'BUDGET AJU APPROUVE'!C31","v":"(Compléter la description) "},null,null,{"$f":"'BUDGET AJU APPROUVE'!G31","v":0},null,{"$f":"'BUDGET AJU APPROUVE'!I31","v":0},{"$f":"S32*U32","v":0},{"$f":"'BUDGET AJU APPROUVE'!K31","v":0},{"$f":"'BUDGET AJU APPROUVE'!L31","v":0},{"$f":"'BUDGET AJU APPROUVE'!M31","v":0},{"$f":"'BUDGET AJU APPROUVE'!N31","v":0},null,null,null,{"$f":"AF32+AH32","v":0},{"$f":"IF(I32=0,0,AD32/I32)","v":0},{"$f":"Investissements!K6","v":0},{"$f":"IF(AD32=0,0,AF32/AD32)","v":0},{"$f":"Investissements!M6","v":0},{"$f":"IF(AD32=0,0,AH32/AD32)","v":0},{"$f":"AL32+AN32","v":0},{"$f":"IF(V32=0,0,AJ32/V32)","v":0},{"$f":"Investissements!K6","v":0},{"$f":"IF(AJ32=0,0,AL32/AJ32)","v":0},{"$f":"Investissements!L6","v":0},{"$f":"IF(AJ32=0,0,AN32/AJ32)","v":0}]
[null,null,{"$f":"IF('BUDGET AJU APPROUVE'!C32=\"(Compléter la description) \",'BUDGET INI APPROUVE'!C35,'BUDGET AJU APPROUVE'!C32)","v":"(à compléter) "},null,null,{"$f":"IF('BUDGET AJU APPROUVE'!G32=0,'BUDGET INI APPROUVE'!G35,'BUDGET AJU APPROUVE'!G32)","v":0},null,{"$f":"IF('BUDGET AJU APPROUVE'!I32=0,'BUDGET INI APPROUVE'!I35,'BUDGET AJU APPROUVE'!I32)","v":0},{"$f":"F33*H33","v":0},{"$f":"IF('BUDGET AJU APPROUVE'!K31=0,'BUDGET INI APPROUVE'!K35,'BUDGET AJU APPROUVE'!K31)","v":0},0,{"$f":"I33-J33","v":0},0,null,null,{"$f":"'BUDGET AJU APPROUVE'!C32","v":"(à compléter) "},null,null,{"$f":"'BUDGET AJU APPROUVE'!G32","v":0},null,{"$f":"'BUDGET AJU APPROUVE'!I32","v":0},{"$f":"S33*U33","v":0},{"$f":"'BUDGET AJU APPROUVE'!K32","v":0},{"$f":"'BUDGET AJU APPROUVE'!L32","v":0},{"$f":"'BUDGET AJU APPROUVE'!M32","v":0},{"$f":"'BUDGET AJU APPROUVE'!N32","v":0},null,null,null,{"$f":"AF33+AH33","v":0},{"$f":"IF(I33=0,0,AD33/I33)","v":0},{"$f":"Investissements!K7","v":0},{"$f":"IF(AD33=0,0,AF33/AD33)","v":0},{"$f":"Investissements!M7","v":0},{"$f":"IF(AD33=0,0,AH33/AD33)","v":0},{"$f":"AL33+AN33","v":0},{"$f":"IF(V33=0,0,AJ33/V33)","v":0},{"$f":"Investissements!K7","v":0},{"$f":"IF(AJ33=0,0,AL33/AJ33)","v":0},{"$f":"Investissements!L7","v":0},{"$f":"IF(AJ33=0,0,AN33/AJ33)","v":0}]
[null,null,{"$f":"IF('BUDGET AJU APPROUVE'!C33=\"(Compléter la description) \",'BUDGET INI APPROUVE'!C36,'BUDGET AJU APPROUVE'!C33)","v":"(à compléter) "},null,null,{"$f":"IF('BUDGET AJU APPROUVE'!G33=0,'BUDGET INI APPROUVE'!G36,'BUDGET AJU APPROUVE'!G33)","v":0},null,{"$f":"IF('BUDGET AJU APPROUVE'!I33=0,'BUDGET INI APPROUVE'!I36,'BUDGET AJU APPROUVE'!I33)","v":0},{"$f":"F34*H34","v":0},{"$f":"IF('BUDGET AJU APPROUVE'!K32=0,'BUDGET INI APPROUVE'!K36,'BUDGET AJU APPROUVE'!K32)","v":0},0,{"$f":"I34-J34","v":0},0,null,null,{"$f":"'BUDGET AJU APPROUVE'!C33","v":"(à compléter) "},null,null,{"$f":"'BUDGET AJU APPROUVE'!G33","v":0},null,{"$f":"'BUDGET AJU APPROUVE'!I33","v":0},{"$f":"S34*U34","v":0},{"$f":"'BUDGET AJU APPROUVE'!K33","v":0},{"$f":"'BUDGET AJU APPROUVE'!L33","v":0},{"$f":"'BUDGET AJU APPROUVE'!M33","v":0},{"$f":"'BUDGET AJU APPROUVE'!N33","v":0},null,null,null,0,{"$f":"IF(I34=0,0,AD34/I34)","v":0},{"$f":"Investissements!K8","v":0},0,{"$f":"Investissements!M8","v":0},0,0,0,{"$f":"Investissements!K8","v":0},0,{"$f":"Investissements!L8","v":0},0]
[null,null,{"$f":"IF('BUDGET AJU APPROUVE'!C34=\"(Compléter la description) \",'BUDGET INI APPROUVE'!C37,'BUDGET AJU APPROUVE'!C34)","v":"(à compléter) "},null,null,{"$f":"IF('BUDGET AJU APPROUVE'!G34=0,'BUDGET INI APPROUVE'!G37,'BUDGET AJU APPROUVE'!G34)","v":0},null,{"$f":"IF('BUDGET AJU APPROUVE'!I34=0,'BUDGET INI APPROUVE'!I37,'BUDGET AJU APPROUVE'!I34)","v":0},{"$f":"F35*H35","v":0},{"$f":"IF('BUDGET AJU APPROUVE'!K33=0,'BUDGET INI APPROUVE'!K37,'BUDGET AJU APPROUVE'!K33)","v":0},0,{"$f":"I35-J35","v":0},0,null,null,{"$f":"'BUDGET AJU APPROUVE'!C34","v":"(à compléter) "},null,null,{"$f":"'BUDGET AJU APPROUVE'!G34","v":0},null,{"$f":"'BUDGET AJU APPROUVE'!I34","v":0},{"$f":"S35*U35","v":0},{"$f":"'BUDGET AJU APPROUVE'!K34","v":0},{"$f":"'BUDGET AJU APPROUVE'!L34","v":0},{"$f":"'BUDGET AJU APPROUVE'!M34","v":0},{"$f":"'BUDGET AJU APPROUVE'!N34","v":0},null,null,null,0,{"$f":"IF(I35=0,0,AD35/I35)","v":0},{"$f":"Investissements!K9","v":0},0,{"$f":"Investissements!M9","v":0},0,0,0,{"$f":"Investissements!K9","v":0},0,{"$f":"Investissements!L9","v":0},0]
[null,null,"Total",null,null,{"$f":"SUM(F32:F35)","v":0},null,null,{"$f":"SUM(I32:I35)","v":0},{"$f":"SUM(J32:J35)","v":{"$error":"#REF!"}},0,{"$f":"SUM(L32:L35)","v":{"$error":"#REF!"}},0,null,null,"Total",null,null,{"$f":"SUM(S32:S35)","v":0},null,null,{"$f":"SUM(V32:V35)","v":0},{"$f":"SUM(W32:W35)","v":0},{"$f":"IF(V36=0,0,W36/V36)","v":0},{"$f":"SUM(Y32:Y35)","v":0},{"$f":"IF(V36=0,0,Y36/V36)","v":0},null,null,null,{"$f":"SUM(AD32:AD35)","v":0},{"$f":"IF(I36=0,0,AD36/I36)","v":0},{"$f":"SUM(AF32:AF35)","v":0},{"$f":"IF(AD36=0,0,AF36/AD36)","v":0},{"$f":"SUM(AH32:AH35)","v":0},{"$f":"IF(AD36=0,0,AH36/AD36)","v":0},{"$f":"SUM(AJ32:AJ35)","v":0},{"$f":"IF(I36=0,0,AJ36/I36)","v":0},{"$f":"SUM(AL32:AL35)","v":0},{"$f":"IF(AJ36=0,0,AL36/AJ36)","v":0},{"$f":"SUM(AN32:AN35)","v":0},{"$f":"IF(AJ36=0,0,AN36/AJ36)","v":0}]
[null,null,"Frais de fonctionnement directs",null,null,null,null,null,null,null,null,null,null,null,null,"Frais de fonctionnement directs"]
[null,null,{"$f":"IF('BUDGET AJU APPROUVE'!C37=\"Choisissez dans la liste Frais de fonctionnement directs \",'BUDGET INI APPROUVE'!C40,'BUDGET AJU APPROUVE'!C37)","v":"Choisissez dans la liste Frais de fonctionnement directs"},null,null,{"$f":"IF('BUDGET AJU APPROUVE'!G37=0,'BUDGET INI APPROUVE'!G40,'BUDGET AJU APPROUVE'!G37)","v":0},null,null,{"$f":"F38","v":0},{"$f":"IF('BUDGET AJU APPROUVE'!K37=0,'BUDGET INI APPROUVE'!K40,'BUDGET AJU APPROUVE'!K37)","v":0},0,{"$f":"I38-J38","v":0},0,null,null,{"$f":"'BUDGET AJU APPROUVE'!C37","v":"Choisissez dans la liste Frais de fonctionnement directs"},{"$f":"'BUDGET AJU APPROUVE'!E37","v":" "},null,{"$f":"'BUDGET AJU APPROUVE'!G37","v":0},null,null,{"$f":"S38","v":0},{"$f":"'BUDGET AJU APPROUVE'!K37","v":0},{"$f":"'BUDGET AJU APPROUVE'!L37","v":0},{"$f":"'BUDGET AJU APPROUVE'!M37","v":0},{"$f":"'BUDGET AJU APPROUVE'!N37","v":0},null,null,null,{"$f":"AF38+AH38","v":0},{"$f":"IF(I38=0,0,AD38/I38)","v":0},{"$f":"'Frais de fonctionnement directs'!I18","v":0},{"$f":"IF(AD38=0,0,AF38/AD38)","v":0},{"$f":"'Frais de fonctionnement directs'!J18","v":0},{"$f":"IF(AD38=0,0,AH38/AD38)","v":0},{"$f":"AL38+AN38","v":0},{"$f":"IF(V38=0,0,AJ38/V38)","v":0},{"$f":"'Frais de fonctionnement directs'!I18","v":0},{"$f":"IF(AJ38=0,0,AL38/AJ38)","v":0},{"$f":"'Frais de fonctionnement directs'!J18","v":0},{"$f":"IF(AJ38=0,0,AN38/AJ38)","v":0}]
[null,null,{"$f":"IF('BUDGET AJU APPROUVE'!C38=\"Choisissez dans la liste Frais de fonctionnement directs \",'BUDGET INI APPROUVE'!C41,'BUDGET AJU APPROUVE'!C38)","v":"Choisissez dans la liste Frais de fonctionnement directs"},null,null,{"$f":"IF('BUDGET AJU APPROUVE'!G38=0,'BUDGET INI APPROUVE'!G41,'BUDGET AJU APPROUVE'!G38)","v":0},null,null,{"$f":"F39","v":0},{"$f":"IF('BUDGET AJU APPROUVE'!K38=0,'BUDGET INI APPROUVE'!K41,'BUDGET AJU APPROUVE'!K38)","v":0},0,{"$f":"I39-J39","v":0},0,null,null,{"$f":"'BUDGET AJU APPROUVE'!C38","v":"Choisissez dans la liste Frais de fonctionnement directs"},{"$f":"'BUDGET AJU APPROUVE'!E38","v":" "},null,{"$f":"'BUDGET AJU APPROUVE'!G38","v":0},null,null,{"$f":"S39","v":0},{"$f":"'BUDGET AJU APPROUVE'!K38","v":0},{"$f":"'BUDGET AJU APPROUVE'!L38","v":0},{"$f":"'BUDGET AJU APPROUVE'!M38","v":0},{"$f":"'BUDGET AJU APPROUVE'!N38","v":0},null,null,null,{"$f":"AF39+AH39","v":0},0,{"$f":"'Frais de fonctionnement directs'!I31","v":0},{"$f":"IF(AD39=0,0,AF39/AD39)","v":0},{"$f":"'Frais de fonctionnement directs'!J31","v":0},0,{"$f":"AL39+AN39","v":0},{"$f":"IF(V39=0,0,AJ39/V39)","v":0},{"$f":"'Frais de fonctionnement directs'!I31","v":0},{"$f":"IF(AJ39=0,0,AL39/AJ39)","v":0},{"$f":"'Frais de fonctionnement directs'!J31","v":0},0]
[null,null,{"$f":"IF('BUDGET AJU APPROUVE'!C39=\"Choisissez dans la liste Frais de fonctionnement directs \",'BUDGET INI APPROUVE'!C42,'BUDGET AJU APPROUVE'!C39)","v":"Choisissez dans la liste Frais de fonctionnement directs"},null,null,{"$f":"IF('BUDGET AJU APPROUVE'!G39=0,'BUDGET INI APPROUVE'!G42,'BUDGET AJU APPROUVE'!G39)","v":0},null,null,{"$f":"F40","v":0},{"$f":"IF('BUDGET AJU APPROUVE'!K39=0,'BUDGET INI APPROUVE'!K42,'BUDGET AJU APPROUVE'!K39)","v":0},0,0,0,null,null,{"$f":"'BUDGET AJU APPROUVE'!C39","v":"Choisissez dans la liste Frais de fonctionnement directs"},{"$f":"'BUDGET AJU APPROUVE'!E39","v":" "},null,{"$f":"'BUDGET AJU APPROUVE'!G39","v":0},null,null,0,{"$f":"'BUDGET AJU APPROUVE'!K39","v":0},{"$f":"'BUDGET AJU APPROUVE'!L39","v":0},{"$f":"'BUDGET AJU APPROUVE'!M39","v":0},{"$f":"'BUDGET AJU APPROUVE'!N39","v":0},null,null,null,0,0,{"$f":"'Frais de fonctionnement directs'!I44","v":0},0,{"$f":"'Frais de fonctionnement directs'!J44","v":0},0,0,0,{"$f":"'Frais de fonctionnement directs'!I44","v":0},0,{"$f":"'Frais de fonctionnement directs'!J44","v":0},0]
[null,null,{"$f":"IF('BUDGET AJU APPROUVE'!C40=\"Choisissez dans la liste Frais de fonctionnement directs \",'BUDGET INI APPROUVE'!C43,'BUDGET AJU APPROUVE'!C40)","v":"Choisissez dans la liste Frais de fonctionnement directs"},null,null,{"$f":"IF('BUDGET AJU APPROUVE'!G40=0,'BUDGET INI APPROUVE'!G43,'BUDGET AJU APPROUVE'!G40)","v":0},null,null,0,{"$f":"IF('BUDGET AJU APPROUVE'!K40=0,'BUDGET INI APPROUVE'!K43,'BUDGET AJU APPROUVE'!K40)","v":0},0,0,0,null,null,{"$f":"'BUDGET AJU APPROUVE'!C40","v":"Choisissez dans la liste Frais de fonctionnement directs"},{"$f":"'BUDGET AJU APPROUVE'!E40","v":" "},null,{"$f":"'BUDGET AJU APPROUVE'!G40","v":0},null,null,0,{"$f":"'BUDGET AJU APPROUVE'!K40","v":0},{"$f":"'BUDGET AJU APPROUVE'!L40","v":0},{"$f":"'BUDGET AJU APPROUVE'!M40","v":0},{"$f":"'BUDGET AJU APPROUVE'!N40","v":0},null,null,null,0,0,{"$f":"'Frais de fonctionnement directs'!I57","v":0},0,{"$f":"'Frais de fonctionnement directs'!J57","v":0},0,0,0,{"$f":"'Frais de fonctionnement directs'!I57","v":0},0,{"$f":"'Frais de fonctionnement directs'!J57","v":0},0]
[null,null,{"$f":"IF('BUDGET AJU APPROUVE'!C41=\"Choisissez dans la liste Frais de fonctionnement directs \",'BUDGET INI APPROUVE'!C44,'BUDGET AJU APPROUVE'!C41)","v":"Choisissez dans la liste Frais de fonctionnement directs"},null,null,{"$f":"IF('BUDGET AJU APPROUVE'!G41=0,'BUDGET INI APPROUVE'!G44,'BUDGET AJU APPROUVE'!G41)","v":0},null,null,0,{"$f":"IF('BUDGET AJU APPROUVE'!K41=0,'BUDGET INI APPROUVE'!K44,'BUDGET AJU APPROUVE'!K41)","v":0},0,0,0,null,null,{"$f":"'BUDGET AJU APPROUVE'!C41","v":"Choisissez dans la liste Frais de fonctionnement directs"},{"$f":"'BUDGET AJU APPROUVE'!E41","v":" "},null,{"$f":"'BUDGET AJU APPROUVE'!G41","v":0},null,null,0,{"$f":"'BUDGET AJU APPROUVE'!K41","v":0},{"$f":"'BUDGET AJU APPROUVE'!L41","v":0},{"$f":"'BUDGET AJU APPROUVE'!M41","v":0},{"$f":"'BUDGET AJU APPROUVE'!N41","v":0},null,null,null,0,0,{"$f":"'Frais de fonctionnement directs'!I70","v":0},0,{"$f":"'Frais de fonctionnement directs'!J70","v":0},0,0,0,{"$f":"'Frais de fonctionnement directs'!I70","v":0},0,{"$f":"'Frais de fonctionnement directs'!J70","v":0},0]
[null,null,{"$f":"IF('BUDGET AJU APPROUVE'!C42=\"Choisissez dans la liste Frais de fonctionnement directs \",'BUDGET INI APPROUVE'!C45,'BUDGET AJU APPROUVE'!C42)","v":"Choisissez dans la liste Frais de fonctionnement directs"},null,null,{"$f":"IF('BUDGET AJU APPROUVE'!G42=0,'BUDGET INI APPROUVE'!G45,'BUDGET AJU APPROUVE'!G42)","v":0},null,null,0,{"$f":"IF('BUDGET AJU APPROUVE'!K42=0,'BUDGET INI APPROUVE'!K45,'BUDGET AJU APPROUVE'!K42)","v":0},0,{"$f":"I43-J43","v":0},0,null,null,{"$f":"'BUDGET AJU APPROUVE'!C42","v":"Choisissez dans la liste Frais de fonctionnement directs"},{"$f":"'BUDGET AJU APPROUVE'!E42","v":" "},null,{"$f":"'BUDGET AJU APPROUVE'!G42","v":0},null,null,0,{"$f":"'BUDGET AJU APPROUVE'!K42","v":0},{"$f":"'BUDGET AJU APPROUVE'!L42","v":0},{"$f":"'BUDGET AJU APPROUVE'!M42","v":0},{"$f":"'BUDGET AJU APPROUVE'!N42","v":0},null,null,null,0,0,{"$f":"'Frais de fonctionnement directs'!I83","v":0},0,{"$f":"'Frais de fonctionnement directs'!J83","v":0},0,0,0,{"$f":"'Frais de fonctionnement directs'!I83","v":0},0,{"$f":"'Frais de fonctionnement directs'!J83","v":0},0]
[null,null,{"$f":"IF('BUDGET AJU APPROUVE'!C43=\"Choisissez dans la liste Frais de fonctionnement directs \",'BUDGET INI APPROUVE'!C46,'BUDGET AJU APPROUVE'!C43)","v":"Choisissez dans la liste Frais de fonctionnement directs"},null,null,{"$f":"IF('BUDGET AJU APPROUVE'!G43=0,'BUDGET INI APPROUVE'!G46,'BUDGET AJU APPROUVE'!G43)","v":0},null,null,0,{"$f":"IF('BUDGET AJU APPROUVE'!K43=0,'BUDGET INI APPROUVE'!K46,'BUDGET AJU APPROUVE'!K43)","v":0},0,{"$f":"I44-J44","v":0},0,null,null,{"$f":"'BUDGET AJU APPROUVE'!C43","v":"Choisissez dans la liste Frais de fonctionnement directs"},{"$f":"'BUDGET AJU APPROUVE'!E43","v":" "},null,{"$f":"'BUDGET AJU APPROUVE'!G43","v":0},null,null,0,{"$f":"'BUDGET AJU APPROUVE'!K43","v":0},{"$f":"'BUDGET AJU APPROUVE'!L43","v":0},{"$f":"'BUDGET AJU APPROUVE'!M43","v":0},{"$f":"'BUDGET AJU APPROUVE'!N43","v":0},null,null,null,0,0,{"$f":"'Frais de fonctionnement directs'!I96","v":0},0,{"$f":"'Frais de fonctionnement directs'!J96","v":0},0,0,0,{"$f":"'Frais de fonctionnement directs'!I96","v":0},0,{"$f":"'Frais de fonctionnement directs'!J96","v":0},0]
[null,null,{"$f":"IF('BUDGET AJU APPROUVE'!C44=\"Choisissez dans la liste Frais de fonctionnement directs \",'BUDGET INI APPROUVE'!C47,'BUDGET AJU APPROUVE'!C44)","v":"Choisissez dans la liste Frais de fonctionnement directs"},null,null,{"$f":"IF('BUDGET AJU APPROUVE'!G44=0,'BUDGET INI APPROUVE'!G47,'BUDGET AJU APPROUVE'!G44)","v":0},null,null,0,{"$f":"IF('BUDGET AJU APPROUVE'!K44=0,'BUDGET INI APPROUVE'!K47,'BUDGET AJU APPROUVE'!K44)","v":0},0,{"$f":"I45-J45","v":0},0,null,null,{"$f":"'BUDGET AJU APPROUVE'!C44","v":"Choisissez dans la liste Frais de fonctionnement directs"},{"$f":"'BUDGET AJU APPROUVE'!E44","v":" "},null,{"$f":"'BUDGET AJU APPROUVE'!G44","v":0},null,null,0,{"$f":"'BUDGET AJU APPROUVE'!K44","v":0},{"$f":"'BUDGET AJU APPROUVE'!L44","v":0},{"$f":"'BUDGET AJU APPROUVE'!M44","v":0},{"$f":"'BUDGET AJU APPROUVE'!N44","v":0},null,null,null,0,0,{"$f":"'Frais de fonctionnement directs'!I109","v":0},0,{"$f":"'Frais de fonctionnement directs'!J109","v":0},0,0,0,{"$f":"'Frais de fonctionnement directs'!I109","v":0},0,{"$f":"'Frais de fonctionnement directs'!J109","v":0},0]
[null,null,{"$f":"IF('BUDGET AJU APPROUVE'!C45=\"Choisissez dans la liste Frais de fonctionnement directs \",'BUDGET INI APPROUVE'!C48,'BUDGET AJU APPROUVE'!C45)","v":"Choisissez dans la liste Frais de fonctionnement directs"},null,null,{"$f":"IF('BUDGET AJU APPROUVE'!G45=0,'BUDGET INI APPROUVE'!G48,'BUDGET AJU APPROUVE'!G45)","v":0},null,null,0,{"$f":"IF('BUDGET AJU APPROUVE'!K45=0,'BUDGET INI APPROUVE'!K48,'BUDGET AJU APPROUVE'!K45)","v":0},0,{"$f":"I46-J46","v":0},0,null,null,{"$f":"'BUDGET AJU APPROUVE'!C45","v":"Choisissez dans la liste Frais de fonctionnement directs"},{"$f":"'BUDGET AJU APPROUVE'!E45","v":" "},null,{"$f":"'BUDGET AJU APPROUVE'!G45","v":0},null,null,0,{"$f":"'BUDGET AJU APPROUVE'!K45","v":0},{"$f":"'BUDGET AJU APPROUVE'!L45","v":0},{"$f":"'BUDGET AJU APPROUVE'!M45","v":0},{"$f":"'BUDGET AJU APPROUVE'!N45","v":0},null,null,null,0,0,{"$f":"'Frais de fonctionnement directs'!I122","v":0},0,{"$f":"'Frais de fonctionnement directs'!J122","v":0},0,0,0,{"$f":"'Frais de fonctionnement directs'!I122","v":0},0,{"$f":"'Frais de fonctionnement directs'!J122","v":0},0]
[null,null,{"$f":"IF('BUDGET AJU APPROUVE'!C46=\"Choisissez dans la liste Frais de fonctionnement directs \",'BUDGET INI APPROUVE'!C49,'BUDGET AJU APPROUVE'!C46)","v":"Autre : (compléter soi-même)"},null,null,{"$f":"IF('BUDGET AJU APPROUVE'!G46=0,'BUDGET INI APPROUVE'!G49,'BUDGET AJU APPROUVE'!G46)","v":0},null,null,0,{"$f":"IF('BUDGET AJU APPROUVE'!K46=0,'BUDGET INI APPROUVE'!K49,'BUDGET AJU APPROUVE'!K46)","v":0},0,{"$f":"I47-J47","v":0},0,null,null,{"$f":"'BUDGET AJU APPROUVE'!C46","v":"Autre : (compléter soi-même)"},{"$f":"'BUDGET AJU APPROUVE'!E46","v":" "},null,{"$f":"'BUDGET AJU APPROUVE'!G46","v":0},null,null,0,{"$f":"'BUDGET AJU APPROUVE'!K46","v":0},{"$f":"'BUDGET AJU APPROUVE'!L46","v":0},{"$f":"'BUDGET AJU APPROUVE'!M46","v":0},{"$f":"'BUDGET AJU APPROUVE'!N46","v":0},null,null,null,0,0,{"$f":"'Frais de fonctionnement directs'!I135","v":0},0,{"$f":"'Frais de fonctionnement directs'!J135","v":0},0,0,0,{"$f":"'Frais de fonctionnement directs'!I135","v":0},0,{"$f":"'Frais de fonctionnement directs'!J135","v":0},0]
[null,null,{"$f":"IF('BUDGET AJU APPROUVE'!C47=\"Choisissez dans la liste Frais de fonctionnement directs \",'BUDGET INI APPROUVE'!C50,'BUDGET AJU APPROUVE'!C47)","v":"Autre : (compléter soi-même)"},null,null,{"$f":"IF('BUDGET AJU APPROUVE'!G47=0,'BUDGET INI APPROUVE'!G50,'BUDGET AJU APPROUVE'!G47)","v":0},null,null,0,{"$f":"IF('BUDGET AJU APPROUVE'!K47=0,'BUDGET INI APPROUVE'!K50,'BUDGET AJU APPROUVE'!K47)","v":0},0,0,0,null,null,{"$f":"'BUDGET AJU APPROUVE'!C47","v":"Autre : (compléter soi-même)"},{"$f":"'BUDGET AJU APPROUVE'!E47","v":" "},null,{"$f":"'BUDGET AJU APPROUVE'!G47","v":0},null,null,0,{"$f":"'BUDGET AJU APPROUVE'!K47","v":0},{"$f":"'BUDGET AJU APPROUVE'!L47","v":0},{"$f":"'BUDGET AJU APPROUVE'!M47","v":0},{"$f":"'BUDGET AJU APPROUVE'!N47","v":0},null,null,null,0,0,{"$f":"'Frais de fonctionnement directs'!I148","v":0},0,{"$f":"'Frais de fonctionnement directs'!J148","v":0},0,0,0,{"$f":"'Frais de fonctionnement directs'!I148","v":0},0,{"$f":"'Frais de fonctionnement directs'!J148","v":0},0]
[null,null,"Total",null,null,{"$f":"SUM(F38:F48)","v":0},null,null,{"$f":"SUM(I38:I48)","v":0},{"$f":"SUM(J38:J48)","v":0},{"$f":"IF(I49=0,0,J49/I49)","v":0},{"$f":"SUM(L38:L48)","v":0},0,null,null,"Total",null,null,{"$f":"SUM(S38:S48)","v":0},null,null,{"$f":"SUM(V38:V48)","v":0},{"$f":"SUM(W38:W48)","v":0},{"$f":"IF(V49=0,0,W49/V49)","v":0},{"$f":"SUM(Y38:Y48)","v":0},{"$f":"IF(V49=0,0,Y49/V49)","v":0},null,null,null,{"$f":"SUM(AD38:AD48)","v":0},0,{"$f":"SUM(AF38:AF48)","v":0},{"$f":"IF(AD49=0,0,AF49/AD49)","v":0},{"$f":"SUM(AH38:AH48)","v":0},{"$f":"IF(AD49=0,0,AH49/AD49)","v":0},{"$f":"SUM(AJ38:AJ48)","v":0},{"$f":"IF(I49=0,0,AJ49/I49)","v":0},{"$f":"SUM(AL38:AL48)","v":0},{"$f":"IF(AJ49=0,0,AL49/AJ49)","v":0},{"$f":"SUM(AN38:AN48)","v":0},{"$f":"IF(AJ49=0,0,AN49/AJ49)","v":0}]
[null,null,"Frais de fonctionnements indirects",null,null,null,null,null,null,null,null,null,null,null,null,"Frais de fonctionnements indirects"]
[null,null,{"$f":"IF('BUDGET AJU APPROUVE'!C50=\"Choisissez dans la liste Frais de fonctionnement indirects \",'BUDGET INI APPROUVE'!C53,'BUDGET AJU APPROUVE'!C50)","v":"Choisissez dans la liste Frais de fonctionnement indirects"},null,null,{"$f":"IF('BUDGET AJU APPROUVE'!G50=0,'BUDGET INI APPROUVE'!G53,'BUDGET AJU APPROUVE'!G50)","v":0},null,{"$f":"'BUDGET INI APPROUVE'!I53","v":0},{"$f":"F51*H51","v":0},{"$f":"IF('BUDGET AJU APPROUVE'!K50=0,'BUDGET INI APPROUVE'!K53,'BUDGET AJU APPROUVE'!K50)","v":0},0,{"$f":"I51-J51","v":0},0,null,null,{"$f":"'BUDGET AJU APPROUVE'!C50","v":"Choisissez dans la liste Frais de fonctionnement indirects"},null,null,{"$f":"'BUDGET AJU APPROUVE'!G50","v":0},null,{"$f":"'BUDGET AJU APPROUVE'!I50","v":0},{"$f":"S51*U51","v":0},{"$f":"'BUDGET AJU APPROUVE'!K50","v":0},{"$f":"'BUDGET AJU APPROUVE'!L50","v":0},{"$f":"'BUDGET AJU APPROUVE'!M50","v":0},{"$f":"'BUDGET AJU APPROUVE'!N50","v":0},null,null,null,{"$f":"AF51+AH51","v":0},{"$f":"IF(I51=0,0,AD51/I51)","v":0},{"$f":"'Frais de fctment indirects'!I18","v":0},{"$f":"IF(AD51=0,0,AF51/AD51)","v":0},{"$f":"'Frais de fctment indirects'!K18","v":0},{"$f":"IF(AD51=0,0,AH51/AD51)","v":0},{"$f":"AL51+AN51","v":0},{"$f":"IF(V51=0,0,AJ51/V51)","v":0},{"$f":"'Frais de fctment indirects'!I18","v":0},{"$f":"IF(AJ51=0,0,AL51/AJ51)","v":0},{"$f":"'Frais de fctment indirects'!K18","v":0},{"$f":"IF(AJ51=0,0,AN51/AJ51)","v":0}]
[null,null,{"$f":"IF('BUDGET AJU APPROUVE'!C51=\"Choisissez dans la liste Frais de fonctionnement indirects \",'BUDGET INI APPROUVE'!C54,'BUDGET AJU APPROUVE'!C51)","v":"Choisissez dans la liste Frais de fonctionnement indirects"},null,null,{"$f":"IF('BUDGET AJU APPROUVE'!G51=0,'BUDGET INI APPROUVE'!G54,'BUDGET AJU APPROUVE'!G51)","v":0},null,{"$f":"'BUDGET INI APPROUVE'!I54","v":0},{"$f":"F52*H52","v":0},{"$f":"IF('BUDGET AJU APPROUVE'!K51=0,'BUDGET INI APPROUVE'!K54,'BUDGET AJU APPROUVE'!K51)","v":0},0,{"$f":"I52-J52","v":0},0,null,null,{"$f":"'BUDGET AJU APPROUVE'!C51","v":"Choisissez dans la liste Frais de fonctionnement indirects"},null,null,{"$f":"'BUDGET AJU APPROUVE'!G51","v":0},null,{"$f":"'BUDGET AJU APPROUVE'!I51","v":0},{"$f":"S52*U52","v":0},{"$f":"'BUDGET AJU APPROUVE'!K51","v":0},{"$f":"'BUDGET AJU APPROUVE'!L51","v":0},{"$f":"'BUDGET AJU APPROUVE'!M51","v":0},{"$f":"'BUDGET AJU APPROUVE'!N51","v":0},null,null,null,{"$f":"AF52+AH52","v":0},0,{"$f":"'Frais de fctment indirects'!I31","v":0},0,{"$f":"'Frais de fctment indirects'!K31","v":0},0,{"$f":"AL52+AN52","v":0},{"$f":"IF(V52=0,0,AJ52/V52)","v":0},{"$f":"'Frais de fctment indirects'!I31","v":0},0,{"$f":"'Frais de fctment indirects'!K31","v":0},0]
[null,null,{"$f":"IF('BUDGET AJU APPROUVE'!C52=\"Choisissez dans la liste Frais de fonctionnement indirects \",'BUDGET INI APPROUVE'!C55,'BUDGET AJU APPROUVE'!C52)","v":"Choisissez dans la liste Frais de fonctionnement indirects"},null,null,{"$f":"IF('BUDGET AJU APPROUVE'!G52=0,'BUDGET INI APPROUVE'!G55,'BUDGET AJU APPROUVE'!G52)","v":0},null,{"$f":"'BUDGET INI APPROUVE'!I55","v":0},0,{"$f":"IF('BUDGET AJU APPROUVE'!K52=0,'BUDGET INI APPROUVE'!K55,'BUDGET AJU APPROUVE'!K52)","v":0},0,0,0,null,null,{"$f":"'BUDGET AJU APPROUVE'!C52","v":"Choisissez dans la liste Frais de fonctionnement indirects"},null,null,{"$f":"'BUDGET AJU APPROUVE'!G52","v":0},null,{"$f":"'BUDGET AJU APPROUVE'!I52","v":0},0,{"$f":"'BUDGET AJU APPROUVE'!K52","v":0},{"$f":"'BUDGET AJU APPROUVE'!L52","v":0},{"$f":"'BUDGET AJU APPROUVE'!M52","v":0},{"$f":"'BUDGET AJU APPROUVE'!N52","v":0},null,null,null,0,0,{"$f":"'Frais de fctment indirects'!I44","v":0},0,{"$f":"'Frais de fctment indirects'!K44","v":0},0,0,0,{"$f":"'Frais de fctment indirects'!I44","v":0},0,{"$f":"'Frais de fctment indirects'!K44","v":0},0]
[null,null,{"$f":"IF('BUDGET AJU APPROUVE'!C53=\"Choisissez dans la liste Frais de fonctionnement indirects \",'BUDGET INI APPROUVE'!C56,'BUDGET AJU APPROUVE'!C53)","v":"Choisissez dans la liste Frais de fonctionnement indirects"},null,null,{"$f":"IF('BUDGET AJU APPROUVE'!G53=0,'BUDGET INI APPROUVE'!G56,'BUDGET AJU APPROUVE'!G53)","v":0},null,{"$f":"'BUDGET INI APPROUVE'!I56","v":0},0,{"$f":"IF('BUDGET AJU APPROUVE'!K53=0,'BUDGET INI APPROUVE'!K56,'BUDGET AJU APPROUVE'!K53)","v":0},0,0,0,null,null,{"$f":"'BUDGET AJU APPROUVE'!C53","v":"Choisissez dans la liste Frais de fonctionnement indirects"},null,null,{"$f":"'BUDGET AJU APPROUVE'!G53","v":0},null,{"$f":"'BUDGET AJU APPROUVE'!I53","v":0},0,{"$f":"'BUDGET AJU APPROUVE'!K53","v":0},{"$f":"'BUDGET AJU APPROUVE'!L53","v":0},{"$f":"'BUDGET AJU APPROUVE'!M53","v":0},{"$f":"'BUDGET AJU APPROUVE'!N53","v":0},null,null,null,0,0,{"$f":"'Frais de fctment indirects'!I57","v":0},0,{"$f":"'Frais de fctment indirects'!K57","v":0},0,0,0,{"$f":"'Frais de fctment indirects'!I57","v":0},0,{"$f":"'Frais de fctment indirects'!K57","v":0},0]
[null,null,{"$f":"IF('BUDGET AJU APPROUVE'!C54=\"Choisissez dans la liste Frais de fonctionnement indirects \",'BUDGET INI APPROUVE'!C57,'BUDGET AJU APPROUVE'!C54)","v":"Choisissez dans la liste Frais de fonctionnement indirects"},null,null,{"$f":"IF('BUDGET AJU APPROUVE'!G54=0,'BUDGET INI APPROUVE'!G57,'BUDGET AJU APPROUVE'!G54)","v":0},null,{"$f":"'BUDGET INI APPROUVE'!I57","v":0},{"$f":"F55*H55","v":0},{"$f":"IF('BUDGET AJU APPROUVE'!K54=0,'BUDGET INI APPROUVE'!K57,'BUDGET AJU APPROUVE'!K54)","v":0},0,{"$f":"I55-J55","v":0},0,null,null,{"$f":"'BUDGET AJU APPROUVE'!C54","v":"Choisissez dans la liste Frais de fonctionnement indirects"},null,null,{"$f":"'BUDGET AJU APPROUVE'!G54","v":0},null,{"$f":"'BUDGET AJU APPROUVE'!I54","v":0},{"$f":"S55*U55","v":0},{"$f":"'BUDGET AJU APPROUVE'!K54","v":0},{"$f":"'BUDGET AJU APPROUVE'!L54","v":0},{"$f":"'BUDGET AJU APPROUVE'!M54","v":0},{"$f":"'BUDGET AJU APPROUVE'!N54","v":0},null,null,null,0,0,{"$f":"'Frais de fctment indirects'!I70","v":0},0,{"$f":"'Frais de fctment indirects'!K70","v":0},0,0,0,{"$f":"'Frais de fctment indirects'!I70","v":0},0,{"$f":"'Frais de fctment indirects'!K70","v":0},0]
[null,null,{"$f":"IF('BUDGET AJU APPROUVE'!C55=\"Choisissez dans la liste Frais de fonctionnement indirects \",'BUDGET INI APPROUVE'!C58,'BUDGET AJU APPROUVE'!C55)","v":"Choisissez dans la liste Frais de fonctionnement indirects"},null,null,{"$f":"IF('BUDGET AJU APPROUVE'!G55=0,'BUDGET INI APPROUVE'!G58,'BUDGET AJU APPROUVE'!G55)","v":0},null,{"$f":"'BUDGET INI APPROUVE'!I58","v":0},{"$f":"F56*H56","v":0},{"$f":"IF('BUDGET AJU APPROUVE'!K55=0,'BUDGET INI APPROUVE'!K58,'BUDGET AJU APPROUVE'!K55)","v":0},0,{"$f":"I56-J56","v":0},0,null,null,{"$f":"'BUDGET AJU APPROUVE'!C55","v":"Choisissez dans la liste Frais de fonctionnement indirects"},null,null,{"$f":"'BUDGET AJU APPROUVE'!G55","v":0},null,{"$f":"'BUDGET AJU APPROUVE'!I55","v":0},{"$f":"S56*U56","v":0},{"$f":"'BUDGET AJU APPROUVE'!K55","v":0},{"$f":"'BUDGET AJU APPROUVE'!L55","v":0},{"$f":"'BUDGET AJU APPROUVE'!M55","v":0},{"$f":"'BUDGET AJU APPROUVE'!N55","v":0},null,null,null,0,0,{"$f":"'Frais de fctment indirects'!I83","v":0},0,{"$f":"'Frais de fctment indirects'!K83","v":0},0,0,0,{"$f":"'Frais de fctment indirects'!I83","v":0},0,{"$f":"'Frais de fctment indirects'!K83","v":0},0]
[null,null,{"$f":"IF('BUDGET AJU APPROUVE'!C56=\"Choisissez dans la liste Frais de fonctionnement indirects \",'BUDGET INI APPROUVE'!C59,'BUDGET AJU APPROUVE'!C56)","v":"Choisissez dans la liste Frais de fonctionnement indirects"},null,null,{"$f":"IF('BUDGET AJU APPROUVE'!G56=0,'BUDGET INI APPROUVE'!G59,'BUDGET AJU APPROUVE'!G56)","v":0},null,{"$f":"'BUDGET INI APPROUVE'!I59","v":0},0,{"$f":"IF('BUDGET AJU APPROUVE'!K56=0,'BUDGET INI APPROUVE'!K59,'BUDGET AJU APPROUVE'!K56)","v":0},0,0,0,null,null,{"$f":"'BUDGET AJU APPROUVE'!C56","v":"Choisissez dans la liste Frais de fonctionnement indirects"},null,null,{"$f":"'BUDGET AJU APPROUVE'!G56","v":0},null,{"$f":"'BUDGET AJU APPROUVE'!I56","v":0},0,{"$f":"'BUDGET AJU APPROUVE'!K56","v":0},{"$f":"'BUDGET AJU APPROUVE'!L56","v":0},{"$f":"'BUDGET AJU APPROUVE'!M56","v":0},{"$f":"'BUDGET AJU APPROUVE'!N56","v":0},null,null,null,0,0,{"$f":"'Frais de fctment indirects'!I96","v":0},0,{"$f":"'Frais de fctment indirects'!K96","v":0},0,0,0,{"$f":"'Frais de fctment indirects'!I96","v":0},0,{"$f":"'Frais de fctment indirects'!K96","v":0},0]
[null,null,{"$f":"IF('BUDGET AJU APPROUVE'!C57=\"Choisissez dans la liste Frais de fonctionnement indirects \",'BUDGET INI APPROUVE'!C60,'BUDGET AJU APPROUVE'!C57)","v":"Choisissez dans la liste Frais de fonctionnement indirects"},null,null,{"$f":"IF('BUDGET AJU APPROUVE'!G57=0,'BUDGET INI APPROUVE'!G60,'BUDGET AJU APPROUVE'!G57)","v":0},null,{"$f":"'BUDGET INI APPROUVE'!I60","v":0},0,{"$f":"IF('BUDGET AJU APPROUVE'!K57=0,'BUDGET INI APPROUVE'!K60,'BUDGET AJU APPROUVE'!K57)","v":0},0,0,0,null,null,{"$f":"'BUDGET AJU APPROUVE'!C57","v":"Choisissez dans la liste Frais de fonctionnement indirects"},null,null,{"$f":"'BUDGET AJU APPROUVE'!G57","v":0},null,{"$f":"'BUDGET AJU APPROUVE'!I57","v":0},0,{"$f":"'BUDGET AJU APPROUVE'!K57","v":0},{"$f":"'BUDGET AJU APPROUVE'!L57","v":0},{"$f":"'BUDGET AJU APPROUVE'!M57","v":0},{"$f":"'BUDGET AJU APPROUVE'!N57","v":0},null,null,null,0,0,{"$f":"'Frais de fctment indirects'!I109","v":0},0,{"$f":"'Frais de fctment indirects'!K109","v":0},0,0,0,{"$f":"'Frais de fctment indirects'!I109","v":0},0,{"$f":"'Frais de fctment indirects'!K109","v":0},0]
[null,null,{"$f":"IF('BUDGET AJU APPROUVE'!C58=\"Choisissez dans la liste Frais de fonctionnement indirects \",'BUDGET INI APPROUVE'!C61,'BUDGET AJU APPROUVE'!C58)","v":"Choisissez dans la liste Frais de fonctionnement indirects"},null,null,{"$f":"IF('BUDGET AJU APPROUVE'!G58=0,'BUDGET INI APPROUVE'!G61,'BUDGET AJU APPROUVE'!G58)","v":0},null,{"$f":"'BUDGET INI APPROUVE'!I61","v":0},0,{"$f":"IF('BUDGET AJU APPROUVE'!K58=0,'BUDGET INI APPROUVE'!K61,'BUDGET AJU APPROUVE'!K58)","v":0},0,0,0,null,null,{"$f":"'BUDGET AJU APPROUVE'!C58","v":"Choisissez dans la liste Frais de fonctionnement indirects"},null,null,{"$f":"'BUDGET AJU APPROUVE'!G58","v":0},null,{"$f":"'BUDGET AJU APPROUVE'!I58","v":0},0,{"$f":"'BUDGET AJU APPROUVE'!K58","v":0},{"$f":"'BUDGET AJU APPROUVE'!L58","v":0},{"$f":"'BUDGET AJU APPROUVE'!M58","v":0},{"$f":"'BUDGET AJU APPROUVE'!N58","v":0},null,null,null,0,0,{"$f":"'Frais de fctment indirects'!I122","v":0},0,{"$f":"'Frais de fctment indirects'!K122","v":0},0,0,0,{"$f":"'Frais de fctment indirects'!I122","v":0},0,{"$f":"'Frais de fctment indirects'!K122","v":0},0]
[null,null,{"$f":"IF('BUDGET AJU APPROUVE'!C59=\"Choisissez dans la liste Frais de fonctionnement indirects \",'BUDGET INI APPROUVE'!C62,'BUDGET AJU APPROUVE'!C59)","v":"Choisissez dans la liste Frais de fonctionnement indirects"},null,null,{"$f":"IF('BUDGET AJU APPROUVE'!G59=0,'BUDGET INI APPROUVE'!G62,'BUDGET AJU APPROUVE'!G59)","v":0},null,{"$f":"'BUDGET INI APPROUVE'!I62","v":0},0,{"$f":"IF('BUDGET AJU APPROUVE'!K59=0,'BUDGET INI APPROUVE'!K62,'BUDGET AJU APPROUVE'!K59)","v":0},0,0,0,null,null,{"$f":"'BUDGET AJU APPROUVE'!C59","v":"Choisissez dans la liste Frais de fonctionnement indirects"},null,null,{"$f":"'BUDGET AJU APPROUVE'!G59","v":0},null,{"$f":"'BUDGET AJU APPROUVE'!I59","v":0},0,{"$f":"'BUDGET AJU APPROUVE'!K59","v":0},{"$f":"'BUDGET AJU APPROUVE'!L59","v":0},{"$f":"'BUDGET AJU APPROUVE'!M59","v":0},{"$f":"'BUDGET AJU APPROUVE'!N59","v":0},null,null,null,0,0,{"$f":"'Frais de fctment indirects'!I135","v":0},0,{"$f":"'Frais de fctment indirects'!K135","v":0},0,0,0,{"$f":"'Frais de fctment indirects'!I135","v":0},0,{"$f":"'Frais de fctment indirects'!K135","v":0},0]
[null,null,null,null,null,null,null,null,null,null,null,null,null,null,null,{"$f":"'BUDGET AJU APPROUVE'!C60","v":"Autre : (compléter soi-même)"},null,null,{"$f":"'BUDGET AJU APPROUVE'!G60","v":0},null,{"$f":"'BUDGET AJU APPROUVE'!I60","v":0},{"$f":"S61*U61","v":0},{"$f":"'BUDGET AJU APPROUVE'!K60","v":0},{"$f":"'BUDGET AJU APPROUVE'!L60","v":0},{"$f":"'BUDGET AJU APPROUVE'!M60","v":0},{"$f":"'BUDGET AJU APPROUVE'!N60","v":0},null,null,null,null,null,null,null,null,null,{"$f":"AL61+AN61","v":0},0,{"$f":"'Frais de fctment indirects'!I136","v":0},{"$f":"IF(AJ61=0,0,AL61/AJ61)","v":0},{"$f":"'Frais de fctment indirects'!K148","v":0},{"$f":"IF(AJ61=0,0,AN61/AJ61)","v":0}]
[null,null,{"$f":"IF('BUDGET AJU APPROUVE'!C61=\"Choisissez dans la liste Frais de fonctionnement indirects \",'BUDGET INI APPROUVE'!C64,'BUDGET AJU APPROUVE'!C61)","v":"Autre : (compléter soi-même)"},null,null,{"$f":"IF('BUDGET AJU APPROUVE'!G61=0,'BUDGET INI APPROUVE'!G64,'BUDGET AJU APPROUVE'!G61)","v":0},null,{"$f":"'BUDGET INI APPROUVE'!I64","v":0},0,{"$f":"IF('BUDGET AJU APPROUVE'!K61=0,'BUDGET INI APPROUVE'!K64,'BUDGET AJU APPROUVE'!K61)","v":0},0,0,0,null,null,{"$f":"'BUDGET AJU APPROUVE'!C61","v":"Autre : (compléter soi-même)"},null,null,{"$f":"'BUDGET AJU APPROUVE'!G61","v":0},null,{"$f":"'BUDGET AJU APPROUVE'!I61","v":0},0,{"$f":"'BUDGET AJU APPROUVE'!K61","v":0},{"$f":"'BUDGET AJU APPROUVE'!L61","v":0},{"$f":"'BUDGET AJU APPROUVE'!M61","v":0},{"$f":"'BUDGET AJU APPROUVE'!N61","v":0},null,null,null,0,0,{"$f":"'Frais de fctment indirects'!I161","v":0},0,{"$f":"'Frais de fctment indirects'!K161","v":0},0,0,0,{"$f":"'Frais de fctment indirects'!I161","v":0},0,{"$f":"'Frais de fctment indirects'!K161","v":0},0]
[null,null,"Total",null,null,{"$f":"SUM(F51:F62)","v":0},null,null,{"$f":"SUM(I51:I62)","v":0},{"$f":"SUM(J51:J62)","v":0},{"$f":"IF(I63=0,0,J63/I63)","v":0},{"$f":"SUM(L51:L62)","v":0},{"$f":"IF(I63=0,0,L63/I63)","v":0},null,null,"Total",null,null,{"$f":"SUM(S51:S62)","v":0},null,null,{"$f":"SUM(V51:V62)","v":0},{"$f":"SUM(W51:W62)","v":0},{"$f":"IF(V63=0,0,W63/V63)","v":0},{"$f":"SUM(Y51:Y62)","v":0},{"$f":"IF(V63=0,0,Y63/V63)","v":0},null,null,null,{"$f":"SUM(AD51:AD62)","v":0},0,{"$f":"SUM(AF51:AF62)","v":0},{"$f":"IF(AD63=0,0,AF63/AD63)","v":0},{"$f":"SUM(AH51:AH62)","v":0},{"$f":"IF(AD63=0,0,AH63/AD63)","v":0},{"$f":"SUM(AJ51:AJ62)","v":0},{"$f":"IF(I63=0,0,AJ63/I63)","v":0},{"$f":"SUM(AL51:AL62)","v":0},{"$f":"IF(AJ63=0,0,AL63/AJ63)","v":0},{"$f":"SUM(AN51:AN62)","v":0},{"$f":"IF(AJ63=0,0,AN63/AJ63)","v":0}]
[null,null,null,null,"MAX DE FRAIS INDIRECTS AUTORISES",null,null,null,null,{"$f":"(J24+J30+J36+J49)/100*7","v":{"$error":"#REF!"}},null,null,null,null,null,null,null,"MAX DE FRAIS INDIRECTS AUTORISES",null,null,null,null,{"$f":"(W24+W30+W36+W49)/100*7","v":0}]
[null,null,"TOTAL",null,null,null,null,null,{"$f":"I63+I49+I36+I30+I24","v":0},{"$f":"J63+J49+J36+J30+J24","v":{"$error":"#REF!"}},0,{"$f":"L63+L49+L36+L30+L24","v":{"$error":"#REF!"}},0,null,null,"TOTAL",null,null,null,null,null,{"$f":"V63+V49+V36+V30+V24","v":0},{"$f":"W63+W49+W36+W30+W24","v":0},{"$f":"IF(V65=0,0,W65/V65)","v":0},{"$f":"Y63+Y49+Y36+Y30+Y24","v":0},{"$f":"IF(V65=0,0,Y65/V65)","v":0},null,null,null,{"$f":"AD24+AD30+AD36+AD49+AD63","v":0},{"$f":"IF(I65=0,0,AD65/I65)","v":0},{"$f":"AF24+AF30+AF36+AF49+AF63","v":0},{"$f":"IF(AD65=0,0,AF65/AD65)","v":0},{"$f":"AH24+AH30+AH36+AH49+AH63","v":0},{"$f":"IF(AD65=0,0,AH65/AD65)","v":0},{"$f":"AJ24+AJ30+AJ36+AJ49+AJ63","v":0},{"$f":"IF(I65=0,0,AJ65/I65)","v":0},{"$f":"AL24+AL30+AL36+AL49+AL63","v":0},{"$f":"IF(AJ65=0,0,AL65/AJ65)","v":0},{"$f":"AN24+AN30+AN36+AN49+AN63","v":0},{"$f":"IF(AJ65=0,0,AN65/AJ65)","v":0}]
[null,null,"* Budget INI = budget initial approuvé par Fedasil",null,null,null,null,null,null,null,null,null,null,null,null,"* Budget INI = budget initial approuvé par Fedasil"]
[null,null,"**Budget AJU= budget ajusté",null,null,null,null,null,null,null,null,null,null,null,null,"**Budget AJU= budget adapté "]
[]
[]
[]
[null,null,null,"BUDGET INI*",null,null,null,null,null,null,null,null,null,null,null,null,"BUDGET AJU**",null,null,null,null,null,null,null,null,null,null,null,null,"REALISE - 6 MOIS",null,null,null,null,null,"REALISE - 12 MOIS"]
[null,null,"Financement",null,null,"Assurance",null,null,"Montant total projet","Approuvé par Fedasil (projet ou activité)","% Fedasil","Autres sources de financement","% autres sources",null,null,"Financement",null,null,"Assurance",null,null,"Montant total projet","Approuvé par Fedasil (projet ou activité)","% Fedasil","Autres sources de financement",null,null,null,null,"Montant total réalisé",null,"Dépenses réelles Fedasil","% Fedasil réalisé","Autres sources réelles de financement ","% autres sources","Montant total réalisé",null,"Dépenses réelles Fedasil","%  réalisé par Fedasil","Autres sources réelles de financement","% autres sources"]
[null,null,{"$f":"IF('BUDGET AJU APPROUVE'!C72='BUDGET INI APPROUVE'!C75,'BUDGET AJU APPROUVE'!C72,'BUDGET INI APPROUVE'!C75)","v":"Fedasil"},null,null,{"$f":"IF('BUDGET AJU APPROUVE'!G72='BUDGET INI APPROUVE'!G75,'BUDGET AJU APPROUVE'!G72,'BUDGET INI APPROUVE'!G75)","v":"Demandé"},null,null,{"$f":"IF('BUDGET AJU APPROUVE'!J72='BUDGET INI APPROUVE'!J75,'BUDGET AJU APPROUVE'!J72,'BUDGET INI APPROUVE'!J75)","v":0},{"$f":"IF('BUDGET AJU APPROUVE'!K72='BUDGET INI APPROUVE'!K75,'BUDGET AJU APPROUVE'!K72,'BUDGET INI APPROUVE'!K75)","v":0},{"$f":"IF($I$65=0,0,J73/$I$65)","v":0},null,null,null,null,{"$f":"'BUDGET AJU APPROUVE'!C72","v":"Fedasil"},null,null,{"$f":"'BUDGET AJU APPROUVE'!G72","v":"Demandé"},null,null,{"$f":"'BUDGET AJU APPROUVE'!J72","v":0},{"$f":"'BUDGET AJU APPROUVE'!K72","v":0},{"$f":"'BUDGET AJU APPROUVE'!L72","v":0},null,null,null,null,null,{"$f":"AD65","v":0},null,{"$f":"AF65","v":0},{"$f":"IF($I$65=0,0,AF73/$I$65)","v":0},null,null,{"$f":"AL65","v":0},null,{"$f":"AL65","v":0},{"$f":"IF($I$65=0,0,AL73/$I$65)","v":0}]
[null,null,{"$f":"IF('BUDGET AJU APPROUVE'!C73='BUDGET INI APPROUVE'!C76,'BUDGET AJU APPROUVE'!C73,'BUDGET INI APPROUVE'!C76)","v":"Moyens propres"},null,null,{"$f":"IF('BUDGET AJU APPROUVE'!G73='BUDGET INI APPROUVE'!G76,'BUDGET AJU APPROUVE'!G73,'BUDGET INI APPROUVE'!G76)","v":"(à compléter)"},null,null,{"$f":"IF('BUDGET AJU APPROUVE'!J73='BUDGET INI APPROUVE'!J76,'BUDGET AJU APPROUVE'!J73,'BUDGET INI APPROUVE'!J76)","v":0},null,null,{"$f":"IF('BUDGET AJU APPROUVE'!M73='BUDGET INI APPROUVE'!M76,'BUDGET AJU APPROUVE'!M73,'BUDGET INI APPROUVE'!M76)","v":0},{"$f":"IF($I$65=0,0,L74/$I$65)","v":0},null,null,{"$f":"'BUDGET AJU APPROUVE'!C73","v":"Moyens propres"},null,null,{"$f":"'BUDGET AJU APPROUVE'!G73","v":"(à compléter)"},null,null,{"$f":"'BUDGET AJU APPROUVE'!J73","v":0},null,null,{"$f":"'BUDGET AJU APPROUVE'!M73","v":0},{"$f":"'BUDGET AJU APPROUVE'!N73","v":0},null,null,null,{"$f":"AH74","v":0},null,null,null,{"$f":"AH65","v":0},{"$f":"AI65","v":0},{"$f":"AN74","v":0},null,null,null,{"$f":"AN65","v":0},{"$f":"IF($I$65=0,0,AN74/$I$65)","v":0}]
[null,null,{"$f":"IF('BUDGET AJU APPROUVE'!C74='BUDGET INI APPROUVE'!C77,'BUDGET AJU APPROUVE'!C74,'BUDGET INI APPROUVE'!C77)","v":"Autre rentrées : (compléter soi-même)"},null,null,{"$f":"IF('BUDGET AJU APPROUVE'!G74='BUDGET INI APPROUVE'!G77,'BUDGET AJU APPROUVE'!G74,'BUDGET INI APPROUVE'!G77)","v":"(à compléter)"},null,null,{"$f":"IF('BUDGET AJU APPROUVE'!J74='BUDGET INI APPROUVE'!J77,'BUDGET AJU APPROUVE'!J74,'BUDGET INI APPROUVE'!J77)","v":0},null,null,{"$f":"IF('BUDGET AJU APPROUVE'!M74='BUDGET INI APPROUVE'!M77,'BUDGET AJU APPROUVE'!M74,'BUDGET INI APPROUVE'!M77)","v":0},0,null,null,{"$f":"'BUDGET AJU APPROUVE'!C74","v":"Autre rentrées : (compléter soi-même)"},null,null,{"$f":"'BUDGET AJU APPROUVE'!G74","v":"(à compléter)"},null,null,{"$f":"'BUDGET AJU APPROUVE'!J74","v":0},null,null,{"$f":"'BUDGET AJU APPROUVE'!M74","v":0},{"$f":"'BUDGET AJU APPROUVE'!N74","v":0},null,null,null,{"$f":"AH75","v":0},null,null,null,0,{"$f":"IF($I$65=0,0,AH75/$I$65)","v":0},{"$f":"AN75","v":0},null,null,null,0,0]
[null,null,{"$f":"IF('BUDGET AJU APPROUVE'!C75='BUDGET INI APPROUVE'!C78,'BUDGET AJU APPROUVE'!C75,'BUDGET INI APPROUVE'!C78)","v":"Autre rentrées : (compléter soi-même)"},null,null,{"$f":"IF('BUDGET AJU APPROUVE'!G75='BUDGET INI APPROUVE'!G78,'BUDGET AJU APPROUVE'!G75,'BUDGET INI APPROUVE'!G78)","v":"(à compléter)"},null,null,{"$f":"IF('BUDGET AJU APPROUVE'!J75='BUDGET INI APPROUVE'!J78,'BUDGET AJU APPROUVE'!J75,'BUDGET INI APPROUVE'!J78)","v":0},null,null,{"$f":"IF('BUDGET AJU APPROUVE'!M75='BUDGET INI APPROUVE'!M78,'BUDGET AJU APPROUVE'!M75,'BUDGET INI APPROUVE'!M78)","v":0},0,null,null,{"$f":"'BUDGET AJU APPROUVE'!C75","v":"Autre rentrées : (compléter soi-même)"},null,null,{"$f":"'BUDGET AJU APPROUVE'!G75","v":"(à compléter)"},null,null,{"$f":"'BUDGET AJU APPROUVE'!J75","v":0},null,null,{"$f":"'BUDGET AJU APPROUVE'!M75","v":0},{"$f":"'BUDGET AJU APPROUVE'!N75","v":0},null,null,null,{"$f":"AH76","v":0},null,null,null,0,{"$f":"IF($I$65=0,0,AH76/$I$65)","v":0},{"$f":"AN76","v":0},null,null,null,0,0]
[null,null,{"$f":"IF('BUDGET AJU APPROUVE'!C76='BUDGET INI APPROUVE'!C79,'BUDGET AJU APPROUVE'!C76,'BUDGET INI APPROUVE'!C79)","v":"Autre rentrées : (compléter soi-même)"},null,null,{"$f":"IF('BUDGET AJU APPROUVE'!G76='BUDGET INI APPROUVE'!G79,'BUDGET AJU APPROUVE'!G76,'BUDGET INI APPROUVE'!G79)","v":"(à compléter)"},null,null,{"$f":"IF('BUDGET AJU APPROUVE'!J76='BUDGET INI APPROUVE'!J79,'BUDGET AJU APPROUVE'!J76,'BUDGET INI APPROUVE'!J79)","v":0},null,null,{"$f":"IF('BUDGET AJU APPROUVE'!M76='BUDGET INI APPROUVE'!M79,'BUDGET AJU APPROUVE'!M76,'BUDGET INI APPROUVE'!M79)","v":0},0,null,null,{"$f":"'BUDGET AJU APPROUVE'!C76","v":"Autre rentrées : (compléter soi-même)"},null,null,{"$f":"'BUDGET AJU APPROUVE'!G76","v":"(à compléter)"},null,null,{"$f":"'BUDGET AJU APPROUVE'!J76","v":0},null,null,{"$f":"'BUDGET AJU APPROUVE'!M76","v":0},{"$f":"'BUDGET AJU APPROUVE'!N76","v":0},null,null,null,{"$f":"AH77","v":0},null,null,null,0,{"$f":"IF($I$65=0,0,AH77/$I$65)","v":0},{"$f":"AN77","v":0},null,null,null,0,0]
[null,null,{"$f":"IF('BUDGET AJU APPROUVE'!C77='BUDGET INI APPROUVE'!C80,'BUDGET AJU APPROUVE'!C77,'BUDGET INI APPROUVE'!C80)","v":"Autre rentrées : (compléter soi-même)"},null,null,{"$f":"IF('BUDGET AJU APPROUVE'!G77='BUDGET INI APPROUVE'!G80,'BUDGET AJU APPROUVE'!G77,'BUDGET INI APPROUVE'!G80)","v":"(à compléter)"},null,null,{"$f":"'BUDGET INI APPROUVE'!J80","v":0},null,null,{"$f":"IF('BUDGET AJU APPROUVE'!M77='BUDGET INI APPROUVE'!M80,'BUDGET AJU APPROUVE'!M77,'BUDGET INI APPROUVE'!M80)","v":0},0,null,null,{"$f":"'BUDGET AJU APPROUVE'!C77","v":"Dons"},null,null,{"$f":"'BUDGET AJU APPROUVE'!G77","v":"(à compléter)"},null,null,{"$f":"'BUDGET AJU APPROUVE'!J77","v":0},null,null,{"$f":"'BUDGET AJU APPROUVE'!M77","v":0},{"$f":"'BUDGET AJU APPROUVE'!N77","v":0},null,null,null,{"$f":"AH78","v":0},null,null,null,0,{"$f":"IF($I$65=0,0,AH78/$I$65)","v":0},{"$f":"AN78","v":0},null,null,null,0,0]
[null,null,"TOTAL",null,null,null,null,null,{"$f":"SUM(I73:I78)","v":0},{"$f":"SUM(J73:J78)","v":0},{"$f":"IF($I$65=0,0,J79/$I$65)","v":0},{"$f":"SUM(L74:L78)","v":0},{"$f":"IF($I$65=0,0,L79/$I$65)","v":0},null,null,"TOTAL",null,null,null,null,null,{"$f":"SUM(V73:V78)","v":0},{"$f":"SUM(W73:W78)","v":0},{"$f":"IF($I$65=0,0,W79/$I$65)","v":0},{"$f":"SUM(Y74:Y78)","v":0},{"$f":"IF($I$65=0,0,Y79/$I$65)","v":0},null,null,null,{"$f":"SUM(AE73:AE78)","v":0},null,{"$f":"SUM(AF73:AF78)","v":0},{"$f":"IF($I$65=0,0,AF79/$I$65)","v":0},{"$f":"SUM(AH74:AH78)","v":0},{"$f":"IF($I$65=0,0,AH79/$I$65)","v":0},{"$f":"SUM(AJ73:AJ78)","v":0},null,{"$f":"SUM(AL73:AL78)","v":0},{"$f":"IF($I$65=0,0,AL79/$I$65)","v":0},{"$f":"SUM(AN74:AN78)","v":0},{"$f":"IF($I$65=0,0,AN79/$I$65)","v":0}]
[]
[null,null,null,null,"DIFFERENCE ENTRE BUDGET ET FINANCEMENT",null,null,null,{"$f":"I65-I79","v":0},null,null,{"$f":"L65-L79","v":{"$error":"#REF!"}},null,null,null,null,null,"DIFFERENCE ENTRE LE BUDGET ET LE FINANCEMENT",null,null,null,{"$f":"V65-V79","v":0},null,null,{"$f":"Y65-Y79","v":0}]

{"sheet":"FEEDBACK Rapport intermédiaire","index":19,"n_rows":27,"n_cols":1,"rows_kept":27,"cut":false,"hidden":true,"merged":[]}
[]
[]
["FEEDBACK RAPPORT INTERMEDIAIRE"]
[{"$f":"CONCATENATE('ETAPE 1'!D11,\" - \",'Questions suppl Rapp FIN'!A3)","v":" - 2021/XX"}]
["CONSTATATION GENERALE"]
[]
[]
[]
[]
[]
[]
[]
[]
[]
[]
["PROPOSITIONS D'AMELIORATION"]
[]
[]
[]
[]
[]
[]
[]
[]
[]
[]
["REPONSE ASBL & REACTION FEDASIL"]

{"sheet":"FEEDBACK Rapport final","index":20,"n_rows":79,"n_cols":8,"rows_kept":79,"cut":false,"hidden":true,"merged":[[61,0,61,6],[61,7,61,8],[2,0,2,8],[1,0,1,8],[3,0,3,8],[39,0,39,8],[47,7,47,8],[47,0,47,6],[78,0,78,6],[78,7,78,8],[48,0,48,6],[48,7,48,8],[56,0,56,6],[56,7,56,8],[62,0,62,6],[62,7,62,8],[70,0,70,6],[70,7,70,8],[69,0,69,6],[69,7,69,8],[77,0,77,6],[77,7,77,8],[55,0,55,6],[55,7,55,8]]}
[]
["FEEDBACK RAPPORT FINAL"]
[{"$f":"CONCATENATE('ETAPE 1'!D11,\" - \",'Questions suppl Rapp FIN'!A3)","v":" - 2021/XX"}]
["CONSTATATION GENERALE"]
[]
["FRAIS DE PERSONNEL"]
[]
[]
[]
[]
[]
[]
["LOCATION"]
[]
[]
[]
[]
[]
[]
["INVESTISSEMENTS"]
[]
[]
[]
[]
[]
["FRAIS DE FONCTIONNEMENT DIRECTS"]
[]
[]
[]
[]
[]
[]
["FRAIS DE FONCTIONNEMENT INDIRECTS"]
[]
[]
[]
[]
[]
[]
["REPONSE ASBL & REACTION FEDASIL"]
[]
["FRAIS DE PERSONNEL"]
[]
[]
[]
[]
[]
["Coût subsidiable",null,null,null,null,null,null,"Coût non subsidiable"]
[{"$f":"'Frais de personnel'!T133","v":0},null,null,null,null,null,null,{"$f":"'Frais de personnel'!U133","v":0}]
["LOCATION"]
[]
[]
[]
[]
[]
["Coût subsidiable",null,null,null,null,null,null,"Coût non subsidiable"]
[{"$f":"Location!M58","v":0},null,null,null,null,null,null,{"$f":"Location!N58","v":0}]
["INVESTISSEMENTS"]
[]
[]
[]
["Coût subsidiable",null,null,null,null,null,null,"Coût non subsidiable"]
[{"$f":"Investissements!O10","v":0},null,null,null,null,null,null,{"$f":"Investissements!P10","v":0}]
["FRAIS DE FONCTIONNEMENT DIRECTS"]
[]
[]
[]
[]
[]
["Coût subsidiable",null,null,null,null,null,null,"Coût non subsidiable"]
[{"$f":"'Frais de fonctionnement directs'!M149","v":0},null,null,null,null,null,null,{"$f":"'Frais de fonctionnement directs'!N149","v":0}]
["FRAIS DE FONCTIONNEMENT INDIRECTS"]
[]
[]
[]
[]
[]
["Coût subsidiable",null,null,null,null,null,null,"Coût non subsidiable"]
[{"$f":"'Frais de fctment indirects'!N162","v":0},null,null,null,null,null,null,{"$f":"'Frais de fctment indirects'!O162","v":0}]

{"sheet":"RAPPORT FINAL DU CONTROLE","index":21,"n_rows":184,"n_cols":9,"rows_kept":184,"cut":false,"hidden":true,"merged":[[179,0,179,9],[156,0,156,9],[157,0,157,9],[158,0,158,9],[177,0,177,9],[159,0,159,9],[68,0,68,9],[151,0,151,9],[153,0,153,9],[154,0,154,9],[155,0,155,9],[116,0,116,9],[135,0,135,9],[118,0,118,9],[102,0,102,9],[85,0,85,9],[130,0,130,9],[131,0,131,9],[132,0,132,9],[148,0,148,9],[174,0,174,9],[175,0,175,9],[163,0,163,9],[93,0,93,9],[94,0,94,9],[95,0,95,9],[96,0,96,9],[97,0,97,9],[98,0,98,9],[83,0,83,9],[87,0,87,9],[53,0,53,9],[54,0,54,9],[56,0,56,9],[59,0,59,9],[60,0,60,9],[61,0,61,9],[63,0,63,9],[57,0,57,9],[58,0,58,9],[162,0,162,9],[164,0,164,9],[173,0,173,9],[165,0,165,9],[166,0,166,9],[167,0,167,9],[168,0,168,9],[169,0,169,9],[170,0,170,9],[171,0,171,9],[172,0,172,9],[49,5,49,6],[49,7,49,8],[48,3,48,4],[48,5,48,6],[48,7,48,8],[50,3,50,4],[50,5,50,6],[50,7,50,8],[161,0,161,9],[129,0,129,9],[120,0,120,9],[104,0,104,9],[66,0,66,5],[66,6,66,9],[79,0,79,9],[80,0,80,9],[81,0,81,9],[82,0,82,9],[100,0,100,9],[88,0,88,9],[89,0,89,9],[90,0,90,9],[91,0,91,9],[92,0,92,9],[127,0,127,9],[128,0,128,9],[36,3,36,4],[1,3,1,5],[12,3,12,5],[13,3,13,5],[15,3,15,5],[3,3,3,4],[46,7,46,8],[47,7,47,8],[37,3,37,4],[38,3,38,4],[39,3,39,4],[40,3,40,4],[45,3,45,4],[45,5,45,6],[45,7,45,8],[46,3,46,4],[46,5,46,6],[47,3,47,4],[47,5,47,6],[4,0,4,6],[4,7,4,8],[49,3,49,4],[5,0,5,6],[6,0,6,9],[137,0,137,9],[51,7,51,8],[71,0,71,9],[72,0,72,9],[73,0,73,9],[74,0,74,9],[75,0,75,9],[77,0,77,9],[78,0,78,9],[64,0,64,9],[76,0,76,9],[70,0,70,9],[51,3,51,4],[51,5,51,6],[133,0,133,9],[99,0,99,9],[121,0,121,9],[122,0,122,9],[123,0,123,9],[124,0,124,9],[125,0,125,9],[126,0,126,9]]}
[]
[]
[]
[]
["Contrôle financier des dépenses de l'année :",null,null,null,null,null,null,{"$f":"RIGHT('BUDGET VS ACTUAL'!C14,4)","v":"2021"}]
["du projet :"]
[{"$f":"'BUDGET AJU APPROUVE'!E10","v":0}]
[]
["Direction / Service Fedasil: Direction Services généraux, Service BF",null,null,null,null,null,null,"Date :",{"$f":"TODAY()","v":"2020-09-11"}]
["Personne de contact Fedasil :",null,null,null,null,null,null,"Annexe : "]
[]
[]
[{"$f":"'DEMANDE DE BUDGET'!C9","v":"Bénéficiaire (asbl) :"},{"$f":"'BUDGET VS ACTUAL'!D9","v":0}]
[{"$f":"'DEMANDE DE BUDGET'!C10","v":"Nom du projet :"},{"$f":"'BUDGET VS ACTUAL'!D10","v":0}]
["Personne de contact financière asbl",{"$f":"'BUDGET VS ACTUAL'!D11","v":0}]
[{"$f":"'DEMANDE DE BUDGET'!C12","v":"Durée du projet (nombre de mois) :"},{"$f":"'BUDGET VS ACTUAL'!D12","v":0}]
["Code de convention","SUB "]
[]
["Convention"]
[{"$f":"CONCATENATE(\"Convention\",\" \",B17)","v":"Convention SUB "},"en lien avec l'attribution d'un subside de xxxx€ avec comme objectif "]
["(voir description dans la convention)"]
[]
[]
["Le Contrôle"]
["Le contrôle financier a été exécuté au moyen du dossier financier introduit électroniquement le jj/mm/aa. "]
["Un échantillon a été pris des dépenses financées par la convention ",null,null,{"$f":"B17","v":"SUB "}]
[{"$f":"CONCATENATE(\"Un questionnaire supplémentaire en lien avec les dépenses introduites\",\" \",H5,\" a été envoyé le \",\"dd/mm/yy verstuurd naar \",A7)","v":"Un questionnaire supplémentaire en lien avec les dépenses introduites 2021 a été envoyé le dd/mm/yy verstuurd naar 0"}]
["Une visite de contrôle a été faite sur place, mais toutes les questions et remarques restantes ont été survolées par mail et par téléphone."]
[]
[]
["Constatations"]
[]
["1.      Financement du projet"]
[]
["Créances reçues par Fedasil : "]
[]
["Montant du subside","Montant reçu","%","Date du paiement"]
[{"$f":"0*0.5","v":0},0,50]
[{"$f":"0*0.3","v":0},0,30]
[{"$f":"0*0.2","v":0},0,"Solde ","après contrôle"]
[{"$f":"'BUDGET VS ACTUAL'!W65","v":0},{"$f":"SUM(B38:B40)","v":0},"TOTAL"]
[]
[]
["2.      Épuisement du budget"]
[]
["Type de frais","Budget INI","Budget AJU","Réels",null,"Variance (€)",null,"Variance (%)"]
["Personnel",{"$f":"C47","v":0},{"$f":"'BUDGET VS ACTUAL'!W24","v":0},{"$f":"'BUDGET VS ACTUAL'!AL24","v":0},null,{"$f":"C47-D47","v":0},null,{"$f":"IFERROR(D47/C47,\"0,00%\")","v":"0,00%"}]
["Location",{"$f":"C48","v":0},{"$f":"'BUDGET VS ACTUAL'!W30","v":0},{"$f":"'BUDGET VS ACTUAL'!AL30","v":0},null,{"$f":"C48-D48","v":0},null,"0,00%"]
["Investissements",{"$f":"C49","v":0},{"$f":"'BUDGET VS ACTUAL'!W36","v":0},{"$f":"'BUDGET VS ACTUAL'!AL36","v":0},null,{"$f":"C49-D49","v":0},null,"0,00%"]
["Frais de fonctionnement directs",{"$f":"C50","v":0},{"$f":"'BUDGET VS ACTUAL'!W49","v":0},{"$f":"'BUDGET VS ACTUAL'!AL49","v":0},null,0,null,"0,00%"]
["Frais de fonctionnement indirects",{"$f":"C51","v":0},{"$f":"'BUDGET VS ACTUAL'!W63","v":0},{"$f":"'BUDGET VS ACTUAL'!AL63","v":0},null,0,null,"0,00%"]
["Total",{"$f":"SUM(B47:B51)","v":0},{"$f":"SUM(C47:C51)","v":0},{"$f":"SUM(D47:E51)","v":0},null,{"$f":"SUM(F47:G51)","v":0},null,"0,00%"]
[]
["L'absl a en mm/aa demandé une modification du budget qui a été approuvée le jj/mm/aa après évaluation et adaptation par Fedasil. "]
["Les principales modifications à l'égard du budget initial se trouvent au nivau :"]
[]
[" - du personnel :"]
[]
[]
[]
[" - Des frais de fonctionnement indirects"]
[]
[]
[]
[" - etc"]
[]
["3.     Résultat contrôle"]
[]
["A.      Frais de personnel"]
[]
["L'Agence a effectué un contrôle de xx% des frais de personnel. Il en ressort que :"]
[]
[]
[]
[]
[]
[]
[]
[]
[]
[]
[]
[]
["Le total des frais de personnel n'est pas subsidiable : xx€"]
[]
["B.      Frais de location"]
[]
["L'Agence a effectué un contrôle de xx% des frais de location. Il en ressort que :"]
[]
[]
[]
[]
[]
[]
[]
[]
[]
[]
[]
[]
["Total des frais de location qui n'est pas subsidiable :xx€"]
[]
["C.      Investissements"]
[]
["L'Agence a effectué un contrôle de xx% des investissements. Il en ressort que :"]
[]
[]
[]
[]
[]
[]
[]
[]
[]
[]
[]
["Total des investissements qui n'est pas subsidiable :xx€"]
[]
["D.      Frais de fonctionnement directs"]
[]
["L'Agence a effectué un contrôle de xx% des frais de fonctionnement directs. Il en ressort que :"]
[]
[]
[]
[]
[]
[]
[]
[]
[]
[]
[]
[]
["Le total des frais de fonctionnement directs n'est pas subsidiable : xx€"]
[]
["E.      Frais de fonctionnement indirects"]
[]
["L'Agence a effectué un contrôle de xx% des frais de fonctionnement indirects. Il en ressort que :"]
[]
[]
[]
[]
[]
[]
[]
[]
[]
[]
["Total des frais de fonctionnement indirects qui n'est pas subsidiable : 0,00 €"]
[]
[]
["F.      Dépenses non subsidiables"]
[]
["Un total de xxx€ n'est pas subsidiable. Les dépenses suivantes ne peuvent pas être acceptées par l'Agence : "]
[]
[]
[]
[]
[]
["Recommandations"]
[]
["L'Agence souhaite signaler que la qualité du rapport introduit est bonne/insuffisante/meilleure comparé à l'année précédente "]
["et peut être amélioré un tant soit peu au moyen des recommandations suivantes. Les recommandations suivantes énumèrent ce qui n'était pas disponible "]
["dans le rapport final xxxx. Il est fortement recommandé de suivre les recommandations suivantes pour les éventuels projets à venir :"]
[]
[]
[]
[]
[]
[]
[]
[]
[]
[]
[]
[]
[]
["Conclusion"]
[]
[{"$f":"CONCATENATE(\"Dans la mise en oeuvre de la convention,  \",H5,\" un montant total de \",D52,\"€\",\" a été introduit. Après contrôle, il s'avère que xx € ne sont pas subsidiables.\" )","v":"Dans la mise en oeuvre de la convention,  2021 un montant total de 0€ a été introduit. Après contrôle, il s'avère que xx € ne sont pas subsidiables."}]
[{"$f":"CONCATENATE(\"Le solde de la convention\",B17,\" \",\"pour un montant de €xxxx sera versé sur le numéro de compte de\",'[1]ETAPE 1'!D17,\" en mentionnant\n“Solde \",B17,\" \",\"nom du projet de \",A7)","v":"Le solde de la conventionSUB  pour un montant de €xxxx sera versé sur le numéro de compte de0 en mentionnant\n“Solde SUB  nom du projet de 0"}]
["OU étant donné que les acomptes payés par l'Agence (xx€) sont plus importants que les dépenses réelles totales subsidiables (xx€), nous souhaitons "]
["vous demander de reverser le montant restant de xx€ au numéro de compte BE58 0910 1265 3879 avec la communication "]
[{"$f":"CONCATENATE(B17, A7,\" solde\", H5,\",dans les 30 jours suivant la réception de cette lettre. \")","v":"SUB 0 solde2021,dans les 30 jours suivant la réception de cette lettre. "}]

{"sheet":"Recap Budget-Depenses","index":22,"n_rows":9,"n_cols":5,"rows_kept":9,"cut":false,"hidden":true,"merged":[[0,0,1,4]]}
["RECAP DEPENSES INTRODUITES"]
[]
["Rubrique","Budget","Werkelijke uitgaven","Variantie (€)","Variantie (%)"]
["Personnel",{"$f":"'BUDGET AJU APPROUVE'!K23","v":0},{"$f":"'Frais de personnel'!N133","v":0},{"$f":"C4-B4","v":0},{"$f":"IFERROR(C4/B4,\"0%\")","v":"0%"}]
["Location",{"$f":"'BUDGET AJU APPROUVE'!K29","v":0},{"$f":"Location!H58","v":0},0,{"$f":"IFERROR(C5/B5,\"0%\")","v":"0%"}]
["Investissements",{"$f":"'BUDGET AJU APPROUVE'!K35","v":0},{"$f":"Investissements!K10","v":0},0,"0%"]
["Frais de fonctionnement directs",{"$f":"'BUDGET AJU APPROUVE'!K48","v":0},{"$f":"'Frais de fonctionnement directs'!I149","v":0},0,"0%"]
["Frais de fonctionnement indirects",{"$f":"'BUDGET AJU APPROUVE'!K62","v":0},{"$f":"'Frais de fctment indirects'!I162","v":0},0,"0%"]
["Total",{"$f":"SUM(B4:B8)","v":0},{"$f":"SUM(C4:C8)","v":0},0,{"$f":"IFERROR(C9/B9,\"0%\")","v":"0%"}]

{"sheet":"Liste Dropdown","index":23,"n_rows":14,"n_cols":8,"rows_kept":14,"cut":false,"hidden":true,"merged":[]}
[]
[null,"Choisissez dans la liste Financement","Assurance",null,"OK ?","Choisissez dans la liste Frais de fonctionnement directs","Choisissez dans la liste Frais de fonctionnement indirects","Recommandations"]
[null,"Autres rentrées","Demandé",null,"OUI","Frais de recrutement","Eau"," - Fournir les aperçus comptables qui permettent pour chaque coût et gain de facilement retrouver la destination comptable et analytique, comme mentionné dans le vademecum financier en page 5."]
[null,"Moyens propres","Provisoirement ",null,"NON","Secrétariat social","Electricité "," - Tous les frais de personnel introduits doivent pouvoir être clairement retrouvés sur la fiche individuelle du secrétariat social. "]
[null,"(à compléter)","Approuvé",null,null,"Médecin du travail","Chauffage"," - Toutes les dépenses doivent être justifiées avec une preuve et doivent être introduites avec le dossier final."]
[null,null,"(à compléter)",null,null,"Frais de déplacement - mission (par km)","Frais d'entretien bâtiment"," - Si des modifications ont eu lieu par rapport au budget approuvé, l'Agence doit immédiatement en être informée par écrit. Le bénéficiaire peut adapter le budget pendant l'exécution via des transferts \nentre les différentes sortes de frais du budget, à condition que cette adaptation ne fasse pas obstacle à l'exécution et que le montant du transfert entre les différentes sortes de frais ne s'élève pas à plus de 10% du montant de chaque sorte de frais. L'Agence peut également accepter exceptionnellement des transferts entre les types de frais de plus de 10% du montant de chaque sorte de frais à condition que cette adaptation ne fasse pas obstacle à l'exécution de l'activité et sans modifier le montant des frais totaux subsidiables. Le bénéficiaire doit demander l'accord écrit préalable de l'Agence au moyen d'une requête de modification du budget, d'après une comparaison avec le budget initial et une argumentation détaillée pour toutes les modifications.  Voir vade-mecum financier en page 2 et 3."]
[null,null,null,null,null,"Formations","Frais d'entretien informatique","  - Dans le rapport financier final, le montant du subside convenu doit toujours être mentionné dans 'demande de subside Fedasil'. S'il y a d'autres budgets pour le H13, veuillez les mettre dans les \n'autres sources de fonctionnement' comme les rentrées, les moyens propres, etc. Si les dépenses réelles pour Fedasil sont plus élevées que les subsides, veuillez mettre le reste du montant dans les autres sources réelles de financement."]
[null,null,null,null,null,"Frais de publication ","Gestion des déchets"," - Les timesheets doivent être un relfet des frais de personnel introduits par mois. "]
[null,null,null,null,null,"Documentation","Frais de téléphone"," - Veuillez tenir compte du fait que toutes les activités et de leurs frais en dehors de l'année d'octroi du subside ne peuvent pas être remboursées par l'Agence."]
[null,null,null,null,null,"Frais de Gsm","Assurances"," - Veuillez tenir compte à l'avenir que sous les frais de fonctionnement directs, seuls les frais qui sont 100% imputables au projet peuvent être introduits. Les autres dépenses réparties entre les différents fonctionnement de projet doivent être introduits sous les autres frais de fonctionnement. "]
[null,null,null,null,null,"Frais de traduction et d’interprétation","Frais de comptabilité"," - Si une formation est introduite, un bref contenu/folder doit être ajouté. Le nom du membre du personnel ayant suivi la formation doit aussi toujours être mentionné. "]
[null,null,null,null,null,"Sous-traitance ","Frais d'impression et de publicité"," - Veuillez toujours vérifier pour chaque frais introduit si une personne externe peut réconcilier ces dépenses au moyen des preuves introduites et vérifiez qu'il y ait une transparence totale."]
[null,null,null,null,null,"Indemnités des bénévoles","Fournitures de bureau"," - Veuillez établir des clés de répartition claires qui tiennent compte de tous les projets de l'organisation, de la taille des projets mais également du fonctionnement général de l'organisation. "]
[null,null,null,null,null,null,"Frais d'envoi"," - Si un membre du personnel ne travaille pas à 100% pour le projet et/ou n'est pas financé à 100% par l'Agence, une annexe au contrat de travail et des timesheets doivent être créées. "]